OpenSceneGraph Forum Forum Index OpenSceneGraph Forum
Official forum which mirrors the existent OSG mailing lists. Messages posted here are forwarded to the mailing list and vice versa.
 
   FAQFAQ    SearchSearch    MemberlistMemberlist    RulesRules    UsergroupsUsergroups    RegisterRegister 
 Mail2Forum SettingsMail2Forum Settings  ProfileProfile   Log in to check your private messagesLog in to check your private messages   Log inLog in 
   AlbumAlbum  OpenSceneGraph IRC ChatOpenSceneGraph IRC Chat   SmartFeedSmartFeed 

Building OpenSceneGraph-3.6.0 on Windows 10 with VS2017


 
Post new topic   Reply to topic    OpenSceneGraph Forum Forum Index -> Build system [build]
View previous topic :: View next topic  
Author Message
dedeu
Newbie


Joined: 19 Apr 2018
Posts: 2

PostPosted: Thu Apr 19, 2018 4:44 pm    Post subject:
Building OpenSceneGraph-3.6.0 on Windows 10 with VS2017
Reply with quote

Hi,
I would like to request some help since I've been unable to build the project using CMake and VS2017.
It's my first time building such a huge project and seems overwhelming at first.
I tried searching online, in the forum and in the openscenegraph website but none of the options worked...

What I've done:

Downloaded the source code from:
github .com/openscenegraph/OpenSceneGraph/tree/OpenSceneGraph-3.6.0

Downloaded dependencies from:
download.osgvisual .org/3rdParty_VS2017_v141_x64_V11_full.7z

CmakeSetup on Cmake 3.11.1:
Visual Studio 15 2014 Win64
Use default native compilers



Upon CMake Generation I edited CMAKE_INCLUDE_PATH and CMAKE_LIBRARY_PATH to match the dependencies include and lib folders, respectively.
I also updated SLD2_INCLUDE_DIR AND SDL2_LIBRARY_LIB sinca I had already compiled SDL2 previously.
Here's the output:


Code:
CMake Deprecation Warning at CMakeLists.txt:40 (cmake_policy):
  The OLD behavior for policy CMP0008 will be removed from a future version
  of CMake.

  The cmake-policies(7) manual explains that the OLD behaviors of all
  policies are deprecated and that a policy should be set to OLD only under
  specific short-term circumstances.  Projects should be ported to the NEW
  behavior and not rely on setting a policy to OLD.


Could NOT find EGL (missing: EGL_LIBRARY EGL_INCLUDE_DIR)
Checking windows version...
64 bit architecture detected
Could NOT find Freetype (missing: FREETYPE_LIBRARY) (found version "2.7.1")
Could NOT find Jasper (missing: JASPER_LIBRARIES JASPER_INCLUDE_DIR)
Could NOT find PkgConfig (missing: PKG_CONFIG_EXECUTABLE)
Trying to find DCMTK expecting DCMTKConfig.cmake
Trying to find DCMTK expecting DCMTKConfig.cmake - failed
Trying to find DCMTK relying on FindDCMTK.cmake
Please set DCMTK_DIR and re-run configure (missing: DCMTK_config_INCLUDE_DIR DCMTK_dcmdata_INCLUDE_DIR DCMTK_dcmimage_INCLUDE_DIR DCMTK_dcmimgle_INCLUDE_DIR DCMTK_dcmjpeg_INCLUDE_DIR DCMTK_dcmjpls_INCLUDE_DIR DCMTK_dcmnet_INCLUDE_DIR DCMTK_dcmpstat_INCLUDE_DIR DCMTK_dcmqrdb_INCLUDE_DIR DCMTK_dcmsign_INCLUDE_DIR DCMTK_dcmsr_INCLUDE_DIR DCMTK_dcmtls_INCLUDE_DIR DCMTK_ofstd_INCLUDE_DIR DCMTK_oflog_INCLUDE_DIR)
Trying to find DCMTK relying on FindDCMTK.cmake - ok
Could NOT find GStreamer (missing: GSTREAMER_INCLUDE_DIRS GSTREAMER_LIBRARIES GSTREAMER_VERSION GSTREAMER_BASE_INCLUDE_DIRS GSTREAMER_BASE_LIBRARIES GSTREAMER_APP_INCLUDE_DIRS GSTREAMER_APP_LIBRARIES GSTREAMER_PBUTILS_INCLUDE_DIRS GSTREAMER_PBUTILS_LIBRARIES)
Could NOT find SDL (missing: SDL_LIBRARY SDL_INCLUDE_DIR)
Could NOT find PkgConfig (missing: PKG_CONFIG_EXECUTABLE)
Could NOT find PkgConfig (missing: PKG_CONFIG_EXECUTABLE)
Could NOT find PkgConfig (missing: PKG_CONFIG_EXECUTABLE)
Configuring done
Generating done




After that I opened the solution on VS2017 and built ALL_BUILD

Heres the result:
[code:1:8ad233787c]
1>------ Compilação iniciada: Projeto: ZERO_CHECK, Configuração: Debug x64 ------
2>------ Compilação iniciada: Projeto: osgDB, Configuração: Debug x64 ------
2>ObjectWrapper.cpp
2>InputStream.cpp
2>OutputStream.cpp
2>Compressors.cpp
2>Archive.cpp
2>AuthenticationMap.cpp
2>Callbacks.cpp
2>ClassInterface.cpp
2>ConvertBase64.cpp
2>ConvertUTF.cpp
2>DatabasePager.cpp
2>DatabaseRevisions.cpp
2>DotOsgWrapper.cpp
2>DynamicLibrary.cpp
2>ExternalFileWriter.cpp
2>Field.cpp
2>FieldReader.cpp
2>FieldReaderIterator.cpp
2>FileCache.cpp
2>FileNameUtils.cpp
2>Gerando Código...
2>Compilando...
2>FileUtils.cpp
2>fstream.cpp
2>ImageOptions.cpp
2>ImagePager.cpp
2>Input.cpp
2>MimeTypes.cpp
2>ObjectCache.cpp
2>Output.cpp
2>Options.cpp
2>PluginQuery.cpp
2>ReaderWriter.cpp
2>ReadFile.cpp
2>Registry.cpp
2>SharedStateManager.cpp
2>StreamOperator.cpp
2>Version.cpp
2>WriteFile.cpp
2>XmlParser.cpp
2>Gerando Código...
2> Criando biblioteca C:/Users/AFCM_/source/repos/OpenSceneGraph-OpenSceneGraph-3.6.0/OpenSceneGraph-OpenSceneGraph-3.6.0/build/lib/osgDBd.lib e objeto C:/Users/AFCM_/source/repos/OpenSceneGraph-OpenSceneGraph-3.6.0/OpenSceneGraph-OpenSceneGraph-3.6.0/build/lib/osgDBd.exp
2>osgDB.vcxproj -> C:\Users\AFCM_\source\repos\OpenSceneGraph-OpenSceneGraph-3.6.0\OpenSceneGraph-OpenSceneGraph-3.6.0\build\bin\osg156-osgDBd.dll
3>------ Compilação iniciada: Projeto: osgText, Configuração: Debug x64 ------
4>------ Compilação iniciada: Projeto: osgGA, Configuração: Debug x64 ------
5>------ Compilação iniciada: Projeto: osgFX, Configuração: Debug x64 ------
6>------ Compilação iniciada: Projeto: osgParticle, Configuração: Debug x64 ------
7>------ Compilação iniciada: Projeto: osgShadow, Configuração: Debug x64 ------
8>------ Compilação iniciada: Projeto: osgTerrain, Configuração: Debug x64 ------
9>------ Compilação iniciada: Projeto: Plugins trk, Configuração: Debug x64 ------
10>------ Compilação iniciada: Projeto: Plugins vtf, Configuração: Debug x64 ------
5> Criando biblioteca C:/Users/AFCM_/source/repos/OpenSceneGraph-OpenSceneGraph-3.6.0/OpenSceneGraph-OpenSceneGraph-3.6.0/build/lib/osgFXd.lib e objeto C:/Users/AFCM_/source/repos/OpenSceneGraph-OpenSceneGraph-3.6.0/OpenSceneGraph-OpenSceneGraph-3.6.0/build/lib/osgFXd.exp
3> Criando biblioteca C:/Users/AFCM_/source/repos/OpenSceneGraph-OpenSceneGraph-3.6.0/OpenSceneGraph-OpenSceneGraph-3.6.0/build/lib/osgTextd.lib e objeto C:/Users/AFCM_/source/repos/OpenSceneGraph-OpenSceneGraph-3.6.0/OpenSceneGraph-OpenSceneGraph-3.6.0/build/lib/osgTextd.exp
4> Criando biblioteca C:/Users/AFCM_/source/repos/OpenSceneGraph-OpenSceneGraph-3.6.0/OpenSceneGraph-OpenSceneGraph-3.6.0/build/lib/osgGAd.lib e objeto C:/Users/AFCM_/source/repos/OpenSceneGraph-OpenSceneGraph-3.6.0/OpenSceneGraph-OpenSceneGraph-3.6.0/build/lib/osgGAd.exp
8> Criando biblioteca C:/Users/AFCM_/source/repos/OpenSceneGraph-OpenSceneGraph-3.6.0/OpenSceneGraph-OpenSceneGraph-3.6.0/build/lib/osgTerraind.lib e objeto C:/Users/AFCM_/source/repos/OpenSceneGraph-OpenSceneGraph-3.6.0/OpenSceneGraph-OpenSceneGraph-3.6.0/build/lib/osgTerraind.exp
6> Criando biblioteca C:/Users/AFCM_/source/repos/OpenSceneGraph-OpenSceneGraph-3.6.0/OpenSceneGraph-OpenSceneGraph-3.6.0/build/lib/osgParticled.lib e objeto C:/Users/AFCM_/source/repos/OpenSceneGraph-OpenSceneGraph-3.6.0/OpenSceneGraph-OpenSceneGraph-3.6.0/build/lib/osgParticled.exp
7> Criando biblioteca C:/Users/AFCM_/source/repos/OpenSceneGraph-OpenSceneGraph-3.6.0/OpenSceneGraph-OpenSceneGraph-3.6.0/build/lib/osgShadowd.lib e objeto C:/Users/AFCM_/source/repos/OpenSceneGraph-OpenSceneGraph-3.6.0/OpenSceneGraph-OpenSceneGraph-3.6.0/build/lib/osgShadowd.exp
5>osgFX.vcxproj -> C:\Users\AFCM_\source\repos\OpenSceneGraph-OpenSceneGraph-3.6.0\OpenSceneGraph-OpenSceneGraph-3.6.0\build\bin\osg156-osgFXd.dll
11>------ Compilação iniciada: Projeto: Plugins x, Configuração: Debug x64 ------
3>osgText.vcxproj -> C:\Users\AFCM_\source\repos\OpenSceneGraph-OpenSceneGraph-3.6.0\OpenSceneGraph-OpenSceneGraph-3.6.0\build\bin\osg156-osgTextd.dll
9>osgdb_trk.vcxproj -> C:\Users\AFCM_\source\repos\OpenSceneGraph-OpenSceneGraph-3.6.0\OpenSceneGraph-OpenSceneGraph-3.6.0\build\bin\osgPlugins-3.6.0\osgdb_trkd.dll
4>osgGA.vcxproj -> C:\Users\AFCM_\source\repos\OpenSceneGraph-OpenSceneGraph-3.6.0\OpenSceneGraph-OpenSceneGraph-3.6.0\build\bin\osg156-osgGAd.dll
10>osgdb_vtf.vcxproj -> C:\Users\AFCM_\source\repos\OpenSceneGraph-OpenSceneGraph-3.6.0\OpenSceneGraph-OpenSceneGraph-3.6.0\build\bin\osgPlugins-3.6.0\osgdb_vtfd.dll
8>osgTerrain.vcxproj -> C:\Users\AFCM_\source\repos\OpenSceneGraph-OpenSceneGraph-3.6.0\OpenSceneGraph-OpenSceneGraph-3.6.0\build\bin\osg156-osgTerraind.dll
6>osgParticle.vcxproj -> C:\Users\AFCM_\source\repos\OpenSceneGraph-OpenSceneGraph-3.6.0\OpenSceneGraph-OpenSceneGraph-3.6.0\build\bin\osg156-osgParticled.dll
11>osgdb_x.vcxproj -> C:\Users\AFCM_\source\repos\OpenSceneGraph-OpenSceneGraph-3.6.0\OpenSceneGraph-OpenSceneGraph-3.6.0\build\bin\osgPlugins-3.6.0\osgdb_xd.dll
7>osgShadow.vcxproj -> C:\Users\AFCM_\source\repos\OpenSceneGraph-OpenSceneGraph-3.6.0\OpenSceneGraph-OpenSceneGraph-3.6.0\build\bin\osg156-osgShadowd.dll
12>------ Compilação iniciada: Projeto: Applications osgversion, Configuração: Debug x64 ------
13>------ Compilação iniciada: Projeto: osgViewer, Configuração: Debug x64 ------
14>------ Compilação iniciada: Projeto: osgVolume, Configuração: Debug x64 ------
15>------ Compilação iniciada: Projeto: osgSim, Configuração: Debug x64 ------
16>------ Compilação iniciada: Projeto: Plugins txf, Configuração: Debug x64 ------
17>------ Compilação iniciada: Projeto: Plugins zip, Configuração: Debug x64 ------
18>------ Compilação iniciada: Projeto: Plugins 3dc, Configuração: Debug x64 ------
19>------ Compilação iniciada: Projeto: Plugins 3ds, Configuração: Debug x64 ------
17>Building Custom Rule C:/Users/AFCM_/source/repos/OpenSceneGraph-OpenSceneGraph-3.6.0/OpenSceneGraph-OpenSceneGraph-3.6.0/src/osgPlugins/zip/CMakeLists.txt
17>CMake does not need to re-run because C:/Users/AFCM_/source/repos/OpenSceneGraph-OpenSceneGraph-3.6.0/OpenSceneGraph-OpenSceneGraph-3.6.0/build/src/osgPlugins/zip/CMakeFiles/generate.stamp is up-to-date.
15> Criando biblioteca C:/Users/AFCM_/source/repos/OpenSceneGraph-OpenSceneGraph-3.6.0/OpenSceneGraph-OpenSceneGraph-3.6.0/build/lib/osgSimd.lib e objeto C:/Users/AFCM_/source/repos/OpenSceneGraph-OpenSceneGraph-3.6.0/OpenSceneGraph-OpenSceneGraph-3.6.0/build/lib/osgSimd.exp
14> Criando biblioteca C:/Users/AFCM_/source/repos/OpenSceneGraph-OpenSceneGraph-3.6.0/OpenSceneGraph-OpenSceneGraph-3.6.0/build/lib/osgVolumed.lib e objeto C:/Users/AFCM_/source/repos/OpenSceneGraph-OpenSceneGraph-3.6.0/OpenSceneGraph-OpenSceneGraph-3.6.0/build/lib/osgVolumed.exp
17>unzip.cpp
13> Criando biblioteca C:/Users/AFCM_/source/repos/OpenSceneGraph-OpenSceneGraph-3.6.0/OpenSceneGraph-OpenSceneGraph-3.6.0/build/lib/osgViewerd.lib e objeto C:/Users/AFCM_/source/repos/OpenSceneGraph-OpenSceneGraph-3.6.0/OpenSceneGraph-OpenSceneGraph-3.6.0/build/lib/osgViewerd.exp
12>application_osgversion.vcxproj -> C:\Users\AFCM_\source\repos\OpenSceneGraph-OpenSceneGraph-3.6.0\OpenSceneGraph-OpenSceneGraph-3.6.0\build\bin\osgversiond.exe
20>------ Compilação iniciada: Projeto: Plugins ac, Configuração: Debug x64 ------
17>ZipArchive.cpp
16>osgdb_txf.vcxproj -> C:\Users\AFCM_\source\repos\OpenSceneGraph-OpenSceneGraph-3.6.0\OpenSceneGraph-OpenSceneGraph-3.6.0\build\bin\osgPlugins-3.6.0\osgdb_txfd.dll
21>------ Compilação iniciada: Projeto: Plugins bmp, Configuração: Debug x64 ------
18>osgdb_3dc.vcxproj -> C:\Users\AFCM_\source\repos\OpenSceneGraph-OpenSceneGraph-3.6.0\OpenSceneGraph-OpenSceneGraph-3.6.0\build\bin\osgPlugins-3.6.0\osgdb_3dcd.dll
22>------ Compilação iniciada: Projeto: Plugins bsp, Configuração: Debug x64 ------
14>osgVolume.vcxproj -> C:\Users\AFCM_\source\repos\OpenSceneGraph-OpenSceneGraph-3.6.0\OpenSceneGraph-OpenSceneGraph-3.6.0\build\bin\osg156-osgVolumed.dll
19>osgdb_3ds.vcxproj -> C:\Users\AFCM_\source\repos\OpenSceneGraph-OpenSceneGraph-3.6.0\OpenSceneGraph-OpenSceneGraph-3.6.0\build\bin\osgPlugins-3.6.0\osgdb_3dsd.dll
23>------ Compilação iniciada: Projeto: Plugins curl, Configuração: Debug x64 ------
24>------ Compilação iniciada: Projeto: Plugins dds, Configuração: Debug x64 ------
23>Building Custom Rule C:/Users/AFCM_/source/repos/OpenSceneGraph-OpenSceneGraph-3.6.0/OpenSceneGraph-OpenSceneGraph-3.6.0/src/osgPlugins/curl/CMakeLists.txt
23>CMake does not need to re-run because C:/Users/AFCM_/source/repos/OpenSceneGraph-OpenSceneGraph-3.6.0/OpenSceneGraph-OpenSceneGraph-3.6.0/build/src/osgPlugins/curl/CMakeFiles/generate.stamp is up-to-date.
20>osgdb_ac.vcxproj -> C:\Users\AFCM_\source\repos\OpenSceneGraph-OpenSceneGraph-3.6.0\OpenSceneGraph-OpenSceneGraph-3.6.0\build\bin\osgPlugins-3.6.0\osgdb_acd.dll
15>osgSim.vcxproj -> C:\Users\AFCM_\source\repos\OpenSceneGraph-OpenSceneGraph-3.6.0\OpenSceneGraph-OpenSceneGraph-3.6.0\build\bin\osg156-osgSimd.dll
21>osgdb_bmp.vcxproj -> C:\Users\AFCM_\source\repos\OpenSceneGraph-OpenSceneGraph-3.6.0\OpenSceneGraph-OpenSceneGraph-3.6.0\build\bin\osgPlugins-3.6.0\osgdb_bmpd.dll
25>------ Compilação iniciada: Projeto: Plugins osg deprecated osg, Configuração: Debug x64 ------
26>------ Compilação iniciada: Projeto: Plugins txp, Configuração: Debug x64 ------
13>osgViewer.vcxproj -> C:\Users\AFCM_\source\repos\OpenSceneGraph-OpenSceneGraph-3.6.0\OpenSceneGraph-OpenSceneGraph-3.6.0\build\bin\osg156-osgViewerd.dll
27>------ Compilação iniciada: Projeto: Plugins osg deprecated osgfx, Configuração: Debug x64 ------
23>ReaderWriterCURL.cpp
28>------ Compilação iniciada: Projeto: osgManipulator, Configuração: Debug x64 ------
22>osgdb_bsp.vcxproj -> C:\Users\AFCM_\source\repos\OpenSceneGraph-OpenSceneGraph-3.6.0\OpenSceneGraph-OpenSceneGraph-3.6.0\build\bin\osgPlugins-3.6.0\osgdb_bspd.dll
29>------ Compilação iniciada: Projeto: osgUI, Configuração: Debug x64 ------
24>osgdb_dds.vcxproj -> C:\Users\AFCM_\source\repos\OpenSceneGraph-OpenSceneGraph-3.6.0\OpenSceneGraph-OpenSceneGraph-3.6.0\build\bin\osgPlugins-3.6.0\osgdb_ddsd.dll
30>------ Compilação iniciada: Projeto: osgWidget, Configuração: Debug x64 ------
28> Criando biblioteca C:/Users/AFCM_/source/repos/OpenSceneGraph-OpenSceneGraph-3.6.0/OpenSceneGraph-OpenSceneGraph-3.6.0/build/lib/osgManipulatord.lib e objeto C:/Users/AFCM_/source/repos/OpenSceneGraph-OpenSceneGraph-3.6.0/OpenSceneGraph-OpenSceneGraph-3.6.0/build/lib/osgManipulatord.exp
29> Criando biblioteca C:/Users/AFCM_/source/repos/OpenSceneGraph-OpenSceneGraph-3.6.0/OpenSceneGraph-OpenSceneGraph-3.6.0/build/lib/osgUId.lib e objeto C:/Users/AFCM_/source/repos/OpenSceneGraph-OpenSceneGraph-3.6.0/OpenSceneGraph-OpenSceneGraph-3.6.0/build/lib/osgUId.exp
27>osgdb_deprecated_osgfx.vcxproj -> C:\Users\AFCM_\source\repos\OpenSceneGraph-OpenSceneGraph-3.6.0\OpenSceneGraph-OpenSceneGraph-3.6.0\build\bin\osgPlugins-3.6.0\osgdb_deprecated_osgfxd.dll
31>------ Compilação iniciada: Projeto: osgAnimation, Configuração: Debug x64 ------
30> Criando biblioteca C:/Users/AFCM_/source/repos/OpenSceneGraph-OpenSceneGraph-3.6.0/OpenSceneGraph-OpenSceneGraph-3.6.0/build/lib/osgWidgetd.lib e objeto C:/Users/AFCM_/source/repos/OpenSceneGraph-OpenSceneGraph-3.6.0/OpenSceneGraph-OpenSceneGraph-3.6.0/build/lib/osgWidgetd.exp
28>osgManipulator.vcxproj -> C:\Users\AFCM_\source\repos\OpenSceneGraph-OpenSceneGraph-3.6.0\OpenSceneGraph-OpenSceneGraph-3.6.0\build\bin\osg156-osgManipulatord.dll
32>------ Compilação iniciada: Projeto: Applications osgarchive, Configuração: Debug x64 ------
29>osgUI.vcxproj -> C:\Users\AFCM_\source\repos\OpenSceneGraph-OpenSceneGraph-3.6.0\OpenSceneGraph-OpenSceneGraph-3.6.0\build\bin\osg156-osgUId.dll
33>------ Compilação iniciada: Projeto: Applications osgconv, Configuração: Debug x64 ------
31> Criando biblioteca C:/Users/AFCM_/source/repos/OpenSceneGraph-OpenSceneGraph-3.6.0/OpenSceneGraph-OpenSceneGraph-3.6.0/build/lib/osgAnimationd.lib e objeto C:/Users/AFCM_/source/repos/OpenSceneGraph-OpenSceneGraph-3.6.0/OpenSceneGraph-OpenSceneGraph-3.6.0/build/lib/osgAnimationd.exp
30>osgWidget.vcxproj -> C:\Users\AFCM_\source\repos\OpenSceneGraph-OpenSceneGraph-3.6.0\OpenSceneGraph-OpenSceneGraph-3.6.0\build\bin\osg156-osgWidgetd.dll
34>------ Compilação iniciada: Projeto: osgPresentation, Configuração: Debug x64 ------
25>osgdb_deprecated_osg.vcxproj -> C:\Users\AFCM_\source\repos\OpenSceneGraph-OpenSceneGraph-3.6.0\OpenSceneGraph-OpenSceneGraph-3.6.0\build\bin\osgPlugins-3.6.0\osgdb_deprecated_osgd.dll
32>application_osgarchive.vcxproj -> C:\Users\AFCM_\source\repos\OpenSceneGraph-OpenSceneGraph-3.6.0\OpenSceneGraph-OpenSceneGraph-3.6.0\build\bin\osgarchived.exe
35>------ Compilação iniciada: Projeto: Applications osgfilecache, Configuração: Debug x64 ------
36>------ Compilação iniciada: Projeto: Applications osgviewer, Configuração: Debug x64 ------
33>application_osgconv.vcxproj -> C:\Users\AFCM_\source\repos\OpenSceneGraph-OpenSceneGraph-3.6.0\OpenSceneGraph-OpenSceneGraph-3.6.0\build\bin\osgconvd.exe
37>------ Compilação iniciada: Projeto: Plugins cfg, Configuração: Debug x64 ------
34> Criando biblioteca C:/Users/AFCM_/source/repos/OpenSceneGraph-OpenSceneGraph-3.6.0/OpenSceneGraph-OpenSceneGraph-3.6.0/build/lib/osgPresentationd.lib e objeto C:/Users/AFCM_/source/repos/OpenSceneGraph-OpenSceneGraph-3.6.0/OpenSceneGraph-OpenSceneGraph-3.6.0/build/lib/osgPresentationd.exp
31>osgAnimation.vcxproj -> C:\Users\AFCM_\source\repos\OpenSceneGraph-OpenSceneGraph-3.6.0\OpenSceneGraph-OpenSceneGraph-3.6.0\build\bin\osg156-osgAnimationd.dll
38>------ Compilação iniciada: Projeto: Plugins bvh, Configuração: Debug x64 ------
36>application_osgviewer.vcxproj -> C:\Users\AFCM_\source\repos\OpenSceneGraph-OpenSceneGraph-3.6.0\OpenSceneGraph-OpenSceneGraph-3.6.0\build\bin\osgviewerd.exe
39>------ Compilação iniciada: Projeto: Plugins osg deprecated osganimation, Configuração: Debug x64 ------
39>C:\Program Files (x86)\Microsoft Visual Studio\2017\Community\Common7\IDE\VC\VCTargets\Microsoft.CppBuild.targets(321,5): error MSB3491: Não foi possível gravar linhas no arquivo "osgdb_deprecated_osganimation.dir\Debug\Plugins .C844942A.tlog\Plugins osg deprecated osganimation.lastbuildstate". O caminho e nome de ficheiro especificados, ou ambos, são demasiado grandes. O nome de ficheiro totalmente qualificado tem de ser inferior a 260 caracteres e o nome do directório tem de ser inferior a 248 caracteres.
39>Projeto de compilação pronto "osgdb_deprecated_osganimation.vcxproj" -- FALHA.
40>------ Compilação iniciada: Projeto: Plugins osg deprecated osgparticle, Configuração: Debug x64 ------
40>C:\Program Files (x86)\Microsoft Visual Studio\2017\Community\Common7\IDE\VC\VCTargets\Microsoft.CppBuild.targets(321,5): error MSB3491: Não foi possível gravar linhas no arquivo "osgdb_deprecated_osgparticle.dir\Debug\Plugins .AF305535.tlog\Plugins osg deprecated osgparticle.lastbuildstate". O caminho e nome de ficheiro especificados, ou ambos, são demasiado grandes. O nome de ficheiro totalmente qualificado tem de ser inferior a 260 caracteres e o nome do directório tem de ser inferior a 248 caracteres.
40>Projeto de compilação pronto "osgdb_deprecated_osgparticle.vcxproj" -- FALHA.
41>------ Compilação iniciada: Projeto: Plugins osg deprecated osgshadow, Configuração: Debug x64 ------
34>osgPresentation.vcxproj -> C:\Users\AFCM_\source\repos\OpenSceneGraph-OpenSceneGraph-3.6.0\OpenSceneGraph-OpenSceneGraph-3.6.0\build\bin\osg156-osgPresentationd.dll
37>osgdb_cfg.vcxproj -> C:\Users\AFCM_\source\repos\OpenSceneGraph-OpenSceneGraph-3.6.0\OpenSceneGraph-OpenSceneGraph-3.6.0\build\bin\osgPlugins-3.6.0\osgdb_cfgd.dll
42>------ Compilação iniciada: Projeto: Plugins osg deprecated osgsim, Configuração: Debug x64 ------
17>ReaderWriterZIP.cpp
38>osgdb_bvh.vcxproj -> C:\Users\AFCM_\source\repos\OpenSceneGraph-OpenSceneGraph-3.6.0\OpenSceneGraph-OpenSceneGraph-3.6.0\build\bin\osgPlugins-3.6.0\osgdb_bvhd.dll
43>------ Compilação iniciada: Projeto: Plugins osg deprecated osgterrain, Configuração: Debug x64 ------
43>C:\Program Files (x86)\Microsoft Visual Studio\2017\Community\Common7\IDE\VC\VCTargets\Microsoft.CppBuild.targets(321,5): error MSB3491: Não foi possível gravar linhas no arquivo "osgdb_deprecated_osgterrain.dir\Debug\Plugins .E950791E.tlog\Plugins osg deprecated osgterrain.lastbuildstate". O caminho e nome de ficheiro especificados, ou ambos, são demasiado grandes. O nome de ficheiro totalmente qualificado tem de ser inferior a 260 caracteres e o nome do directório tem de ser inferior a 248 caracteres.
43>Projeto de compilação pronto "osgdb_deprecated_osgterrain.vcxproj" -- FALHA.
44>------ Compilação iniciada: Projeto: Plugins osg deprecated osgtext, Configuração: Debug x64 ------
41>osgdb_deprecated_osgshadow.vcxproj -> C:\Users\AFCM_\source\repos\OpenSceneGraph-OpenSceneGraph-3.6.0\OpenSceneGraph-OpenSceneGraph-3.6.0\build\bin\osgPlugins-3.6.0\osgdb_deprecated_osgshadowd.dll
45>------ Compilação iniciada: Projeto: Plugins osg deprecated osgviewer, Configuração: Debug x64 ------
35>application_osgfilecache.vcxproj -> C:\Users\AFCM_\source\repos\OpenSceneGraph-OpenSceneGraph-3.6.0\OpenSceneGraph-OpenSceneGraph-3.6.0\build\bin\osgfilecached.exe
42>osgdb_deprecated_osgsim.vcxproj -> C:\Users\AFCM_\source\repos\OpenSceneGraph-OpenSceneGraph-3.6.0\OpenSceneGraph-OpenSceneGraph-3.6.0\build\bin\osgPlugins-3.6.0\osgdb_deprecated_osgsimd.dll
46>------ Compilação iniciada: Projeto: Plugins osg deprecated osgvolume, Configuração: Debug x64 ------
44>osgdb_deprecated_osgtext.vcxproj -> C:\Users\AFCM_\source\repos\OpenSceneGraph-OpenSceneGraph-3.6.0\OpenSceneGraph-OpenSceneGraph-3.6.0\build\bin\osgPlugins-3.6.0\osgdb_deprecated_osgtextd.dll
47>------ Compilação iniciada: Projeto: Plugins osg deprecated osgwidget, Configuração: Debug x64 ------
26>osgdb_txp.vcxproj -> C:\Users\AFCM_\source\repos\OpenSceneGraph-OpenSceneGraph-3.6.0\OpenSceneGraph-OpenSceneGraph-3.6.0\build\bin\osgPlugins-3.6.0\osgdb_txpd.dll
45>osgdb_deprecated_osgviewer.vcxproj -> C:\Users\AFCM_\source\repos\OpenSceneGraph-OpenSceneGraph-3.6.0\OpenSceneGraph-OpenSceneGraph-3.6.0\build\bin\osgPlugins-3.6.0\osgdb_deprecated_osgviewerd.dll
48>------ Compilação iniciada: Projeto: Plugins dot, Configuração: Debug x64 ------
49>------ Compilação iniciada: Projeto: Applications present3D, Configuração: Debug x64 ------
50>------ Compilação iniciada: Projeto: Plugins dxf, Configuração: Debug x64 ------
46>osgdb_deprecated_osgvolume.vcxproj -> C:\Users\AFCM_\source\repos\OpenSceneGraph-OpenSceneGraph-3.6.0\OpenSceneGraph-OpenSceneGraph-3.6.0\build\bin\osgPlugins-3.6.0\osgdb_deprecated_osgvolumed.dll
51>------ Compilação iniciada: Projeto: Plugins gdal, Configuração: Debug x64 ------
52>------ Compilação iniciada: Projeto: Plugins gles, Configuração: Debug x64 ------
51>Building Custom Rule C:/Users/AFCM_/source/repos/OpenSceneGraph-OpenSceneGraph-3.6.0/OpenSceneGraph-OpenSceneGraph-3.6.0/src/osgPlugins/gdal/CMakeLists.txt
51>CMake does not need to re-run because C:/Users/AFCM_/source/repos/OpenSceneGraph-OpenSceneGraph-3.6.0/OpenSceneGraph-OpenSceneGraph-3.6.0/build/src/osgPlugins/gdal/CMakeFiles/generate.stamp is up-to-date.
47>osgdb_deprecated_osgwidget.vcxproj -> C:\Users\AFCM_\source\repos\OpenSceneGraph-OpenSceneGraph-3.6.0\OpenSceneGraph-OpenSceneGraph-3.6.0\build\bin\osgPlugins-3.6.0\osgdb_deprecated_osgwidgetd.dll
48>osgdb_dot.vcxproj -> C:\Users\AFCM_\source\repos\OpenSceneGraph-OpenSceneGraph-3.6.0\OpenSceneGraph-OpenSceneGraph-3.6.0\build\bin\osgPlugins-3.6.0\osgdb_dotd.dll
53>------ Compilação iniciada: Projeto: Plugins glsl, Configuração: Debug x64 ------
51>ReaderWriterGDAL.cpp
54>------ Compilação iniciada: Projeto: Plugins gz, Configuração: Debug x64 ------
54>Building Custom Rule C:/Users/AFCM_/source/repos/OpenSceneGraph-OpenSceneGraph-3.6.0/OpenSceneGraph-OpenSceneGraph-3.6.0/src/osgPlugins/gz/CMakeLists.txt
54>CMake does not need to re-run because C:/Users/AFCM_/source/repos/OpenSceneGraph-OpenSceneGraph-3.6.0/OpenSceneGraph-OpenSceneGraph-3.6.0/build/src/osgPlugins/gz/CMakeFiles/generate.stamp is up-to-date.
23>osgdb_curl.vcxproj -> C:\Users\AFCM_\source\repos\OpenSceneGraph-OpenSceneGraph-3.6.0\OpenSceneGraph-OpenSceneGraph-3.6.0\build\bin\osgPlugins-3.6.0\osgdb_curld.dll
55>------ Compilação iniciada: Projeto: Plugins hdr, Configuração: Debug x64 ------
54>ReaderWriterGZ.cpp
50>osgdb_dxf.vcxproj -> C:\Users\AFCM_\source\repos\OpenSceneGraph-OpenSceneGraph-3.6.0\OpenSceneGraph-OpenSceneGraph-3.6.0\build\bin\osgPlugins-3.6.0\osgdb_dxfd.dll
56>------ Compilação iniciada: Projeto: Plugins ive, Configuração: Debug x64 ------
53>osgdb_glsl.vcxproj -> C:\Users\AFCM_\source\repos\OpenSceneGraph-OpenSceneGraph-3.6.0\OpenSceneGraph-OpenSceneGraph-3.6.0\build\bin\osgPlugins-3.6.0\osgdb_glsld.dll
57>------ Compilação iniciada: Projeto: Plugins jpeg, Configuração: Debug x64 ------
57>Building Custom Rule C:/Users/AFCM_/source/repos/OpenSceneGraph-OpenSceneGraph-3.6.0/OpenSceneGraph-OpenSceneGraph-3.6.0/src/osgPlugins/jpeg/CMakeLists.txt
57>CMake does not need to re-run because C:/Users/AFCM_/source/repos/OpenSceneGraph-OpenSceneGraph-3.6.0/OpenSceneGraph-OpenSceneGraph-3.6.0/build/src/osgPlugins/jpeg/CMakeFiles/generate.stamp is up-to-date.
57>EXIF_Orientation.cpp
56>AlphaFunc.cpp
55>osgdb_hdr.vcxproj -> C:\Users\AFCM_\source\repos\OpenSceneGraph-OpenSceneGraph-3.6.0\OpenSceneGraph-OpenSceneGraph-3.6.0\build\bin\osgPlugins-3.6.0\osgdb_hdrd.dll
58>------ Compilação iniciada: Projeto: Plugins ktx, Configuração: Debug x64 ------
57>ReaderWriterJPEG.cpp
49>application_present3D.vcxproj -> C:\Users\AFCM_\source\repos\OpenSceneGraph-OpenSceneGraph-3.6.0\OpenSceneGraph-OpenSceneGraph-3.6.0\build\bin\present3Dd.exe
52>osgdb_gles.vcxproj -> C:\Users\AFCM_\source\repos\OpenSceneGraph-OpenSceneGraph-3.6.0\OpenSceneGraph-OpenSceneGraph-3.6.0\build\bin\osgPlugins-3.6.0\osgdb_glesd.dll
59>------ Compilação iniciada: Projeto: Plugins logo, Configuração: Debug x64 ------
58>osgdb_ktx.vcxproj -> C:\Users\AFCM_\source\repos\OpenSceneGraph-OpenSceneGraph-3.6.0\OpenSceneGraph-OpenSceneGraph-3.6.0\build\bin\osgPlugins-3.6.0\osgdb_ktxd.dll
60>------ Compilação iniciada: Projeto: Plugins lua, Configuração: Debug x64 ------
17>Gerando Código...
59>osgdb_logo.vcxproj -> C:\Users\AFCM_\source\repos\OpenSceneGraph-OpenSceneGraph-3.6.0\OpenSceneGraph-OpenSceneGraph-3.6.0\build\bin\osgPlugins-3.6.0\osgdb_logod.dll
61>------ Compilação iniciada: Projeto: Plugins lwo, Configuração: Debug x64 ------
62>------ Compilação iniciada: Projeto: Plugins lws, Configuração: Debug x64 ------
60>osgdb_lua.vcxproj -> C:\Users\AFCM_\source\repos\OpenSceneGraph-OpenSceneGraph-3.6.0\OpenSceneGraph-OpenSceneGraph-3.6.0\build\bin\osgPlugins-3.6.0\osgdb_luad.dll
63>------ Compilação iniciada: Projeto: Plugins md2, Configuração: Debug x64 ------
62>osgdb_lws.vcxproj -> C:\Users\AFCM_\source\repos\OpenSceneGraph-OpenSceneGraph-3.6.0\OpenSceneGraph-OpenSceneGraph-3.6.0\build\bin\osgPlugins-3.6.0\osgdb_lwsd.dll
64>------ Compilação iniciada: Projeto: Plugins mdl, Configuração: Debug x64 ------
61>osgdb_lwo.vcxproj -> C:\Users\AFCM_\source\repos\OpenSceneGraph-OpenSceneGraph-3.6.0\OpenSceneGraph-OpenSceneGraph-3.6.0\build\bin\osgPlugins-3.6.0\osgdb_lwod.dll
65>------ Compilação iniciada: Projeto: Plugins normals, Configuração: Debug x64 ------
66>------ Compilação iniciada: Projeto: Plugins nvtt, Configuração: Debug x64 ------
66>Building Custom Rule C:/Users/AFCM_/source/repos/OpenSceneGraph-OpenSceneGraph-3.6.0/OpenSceneGraph-OpenSceneGraph-3.6.0/src/osgPlugins/nvtt/CMakeLists.txt
66>CMake does not need to re-run because C:/Users/AFCM_/source/repos/OpenSceneGraph-OpenSceneGraph-3.6.0/OpenSceneGraph-OpenSceneGraph-3.6.0/build/src/osgPlugins/nvtt/CMakeFiles/generate.stamp is up-to-date.
66>NVTTImageProcessor.cpp
64>osgdb_mdl.vcxproj -> C:\Users\AFCM_\source\repos\OpenSceneGraph-OpenSceneGraph-3.6.0\OpenSceneGraph-OpenSceneGraph-3.6.0\build\bin\osgPlugins-3.6.0\osgdb_mdld.dll
67>------ Compilação iniciada: Projeto: Plugins obj, Configuração: Debug x64 ------
51>DataSetLayer.cpp
65>osgdb_normals.vcxproj -> C:\Users\AFCM_\source\repos\OpenSceneGraph-OpenSceneGraph-3.6.0\OpenSceneGraph-OpenSceneGraph-3.6.0\build\bin\osgPlugins-3.6.0\osgdb_normalsd.dll
68>------ Compilação iniciada: Projeto: Plugins ogr, Configuração: Debug x64 ------
67>osgdb_obj.vcxproj -> C:\Users\AFCM_\source\repos\OpenSceneGraph-OpenSceneGraph-3.6.0\OpenSceneGraph-OpenSceneGraph-3.6.0\build\bin\osgPlugins-3.6.0\osgdb_objd.dll
69>------ Compilação iniciada: Projeto: Plugins openflight, Configuração: Debug x64 ------
54>osgdb_gz.vcxproj -> C:\Users\AFCM_\source\repos\OpenSceneGraph-OpenSceneGraph-3.6.0\OpenSceneGraph-OpenSceneGraph-3.6.0\build\bin\osgPlugins-3.6.0\osgdb_gzd.dll
70>------ Compilação iniciada: Projeto: Plugins osc, Configuração: Debug x64 ------
56>AnimationPathCallback.cpp
57>Gerando Código...
57>jpeg.lib(jerror.obj) : MSIL .netmodule ou módulo compilado com /GL encontrado; reiniciando link com /LTCG; adicione /LTCG ao link da linha de comando para melhorar performance do vinculador
57>LINK : warning LNK4075: ignorando '/INCREMENTAL' devido a especificaþÒo '/LTCG'
57>LINK : warning LNK4098: defaultlib 'MSVCRT' conflita com uso de outras bibliotecas; use /NODEFAULTLIB:library
57>Gerando c¾digo
71>------ Compilação iniciada: Projeto: Plugins osg, Configuração: Debug x64 ------
57>Finalizada a geraþÒo de c¾digo
57>jpeg.lib(jerror.obj) : warning LNK4099: PDB 'jpeg.pdb' nÒo foi encontrado 'jpeg.lib(jerror.obj)' ou no 'C:\Users\AFCM_\source\repos\OpenSceneGraph-OpenSceneGraph-3.6.0\OpenSceneGraph-OpenSceneGraph-3.6.0\build\bin\osgPlugins-3.6.0\jpeg.pdb'; vinculando objeto quando quando sem nenhuma informaþÒo de depuraþÒo
69>osgdb_openflight.vcxproj -> C:\Users\AFCM_\source\repos\OpenSceneGraph-OpenSceneGraph-3.6.0\OpenSceneGraph-OpenSceneGraph-3.6.0\build\bin\osgPlugins-3.6.0\osgdb_openflightd.dll
72>------ Compilação iniciada: Projeto: Plugins osga, Configuração: Debug x64 ------
57>jpeg.lib(jcapimin.obj) : warning LNK4099: PDB 'jpeg.pdb' nÒo foi encontrado 'jpeg.lib(jcapimin.obj)' ou no 'C:\Users\AFCM_\source\repos\OpenSceneGraph-OpenSceneGraph-3.6.0\OpenSceneGraph-OpenSceneGraph-3.6.0\build\bin\osgPlugins-3.6.0\jpeg.pdb'; vinculando objeto quando quando sem nenhuma informaþÒo de depuraþÒo
57>jpeg.lib(jdapimin.obj) : warning LNK4099: PDB 'jpeg.pdb' nÒo foi encontrado 'jpeg.lib(jdapimin.obj)' ou no 'C:\Users\AFCM_\source\repos\OpenSceneGraph-OpenSceneGraph-3.6.0\OpenSceneGraph-OpenSceneGraph-3.6.0\build\bin\osgPlugins-3.6.0\jpeg.pdb'; vinculando objeto quando quando sem nenhuma informaþÒo de depuraþÒo
57>jpeg.lib(jcparam.obj) : warning LNK4099: PDB 'jpeg.pdb' nÒo foi encontrado 'jpeg.lib(jcparam.obj)' ou no 'C:\Users\AFCM_\source\repos\OpenSceneGraph-OpenSceneGraph-3.6.0\OpenSceneGraph-OpenSceneGraph-3.6.0\build\bin\osgPlugins-3.6.0\jpeg.pdb'; vinculando objeto quando quando sem nenhuma informaþÒo de depuraþÒo
57>jpeg.lib(jcapistd.obj) : warning LNK4099: PDB 'jpeg.pdb' nÒo foi encontrado 'jpeg.lib(jcapistd.obj)' ou no 'C:\Users\AFCM_\source\repos\OpenSceneGraph-OpenSceneGraph-3.6.0\OpenSceneGraph-OpenSceneGraph-3.6.0\build\bin\osgPlugins-3.6.0\jpeg.pdb'; vinculando objeto quando quando sem nenhuma informaþÒo de depuraþÒo
57>jpeg.lib(jdapistd.obj) : warning LNK4099: PDB 'jpeg.pdb' nÒo foi encontrado 'jpeg.lib(jdapistd.obj)' ou no 'C:\Users\AFCM_\source\repos\OpenSceneGraph-OpenSceneGraph-3.6.0\OpenSceneGraph-OpenSceneGraph-3.6.0\build\bin\osgPlugins-3.6.0\jpeg.pdb'; vinculando objeto quando quando sem nenhuma informaþÒo de depuraþÒo
57>jpeg.lib(jdmarker.obj) : warning LNK4099: PDB 'jpeg.pdb' nÒo foi encontrado 'jpeg.lib(jdmarker.obj)' ou no 'C:\Users\AFCM_\source\repos\OpenSceneGraph-OpenSceneGraph-3.6.0\OpenSceneGraph-OpenSceneGraph-3.6.0\build\bin\osgPlugins-3.6.0\jpeg.pdb'; vinculando objeto quando quando sem nenhuma informaþÒo de depuraþÒo
57>jpeg.lib(jcomapi.obj) : warning LNK4099: PDB 'jpeg.pdb' nÒo foi encontrado 'jpeg.lib(jcomapi.obj)' ou no 'C:\Users\AFCM_\source\repos\OpenSceneGraph-OpenSceneGraph-3.6.0\OpenSceneGraph-OpenSceneGraph-3.6.0\build\bin\osgPlugins-3.6.0\jpeg.pdb'; vinculando objeto quando quando sem nenhuma informaþÒo de depuraþÒo
57>jpeg.lib(jutils.obj) : warning LNK4099: PDB 'jpeg.pdb' nÒo foi encontrado 'jpeg.lib(jutils.obj)' ou no 'C:\Users\AFCM_\source\repos\OpenSceneGraph-OpenSceneGraph-3.6.0\OpenSceneGraph-OpenSceneGraph-3.6.0\build\bin\osgPlugins-3.6.0\jpeg.pdb'; vinculando objeto quando quando sem nenhuma informaþÒo de depuraþÒo
57>jpeg.lib(jmemmgr.obj) : warning LNK4099: PDB 'jpeg.pdb' nÒo foi encontrado 'jpeg.lib(jmemmgr.obj)' ou no 'C:\Users\AFCM_\source\repos\OpenSceneGraph-OpenSceneGraph-3.6.0\OpenSceneGraph-OpenSceneGraph-3.6.0\build\bin\osgPlugins-3.6.0\jpeg.pdb'; vinculando objeto quando quando sem nenhuma informaþÒo de depuraþÒo
57>jpeg.lib(jcmarker.obj) : warning LNK4099: PDB 'jpeg.pdb' nÒo foi encontrado 'jpeg.lib(jcmarker.obj)' ou no 'C:\Users\AFCM_\source\repos\OpenSceneGraph-OpenSceneGraph-3.6.0\OpenSceneGraph-OpenSceneGraph-3.6.0\build\bin\osgPlugins-3.6.0\jpeg.pdb'; vinculando objeto quando quando sem nenhuma informaþÒo de depuraþÒo
57>jpeg.lib(jdinput.obj) : warning LNK4099: PDB 'jpeg.pdb' nÒo foi encontrado 'jpeg.lib(jdinput.obj)' ou no 'C:\Users\AFCM_\source\repos\OpenSceneGraph-OpenSceneGraph-3.6.0\OpenSceneGraph-OpenSceneGraph-3.6.0\build\bin\osgPlugins-3.6.0\jpeg.pdb'; vinculando objeto quando quando sem nenhuma informaþÒo de depuraþÒo
57>jpeg.lib(jcinit.obj) : warning LNK4099: PDB 'jpeg.pdb' nÒo foi encontrado 'jpeg.lib(jcinit.obj)' ou no 'C:\Users\AFCM_\source\repos\OpenSceneGraph-OpenSceneGraph-3.6.0\OpenSceneGraph-OpenSceneGraph-3.6.0\build\bin\osgPlugins-3.6.0\jpeg.pdb'; vinculando objeto quando quando sem nenhuma informaþÒo de depuraþÒo
57>jpeg.lib(jdmaster.obj) : warning LNK4099: PDB 'jpeg.pdb' nÒo foi encontrado 'jpeg.lib(jdmaster.obj)' ou no 'C:\Users\AFCM_\source\repos\OpenSceneGraph-OpenSceneGraph-3.6.0\OpenSceneGraph-OpenSceneGraph-3.6.0\build\bin\osgPlugins-3.6.0\jpeg.pdb'; vinculando objeto quando quando sem nenhuma informaþÒo de depuraþÒo
57>jpeg.lib(jmemnobs.obj) : warning LNK4099: PDB 'jpeg.pdb' nÒo foi encontrado 'jpeg.lib(jmemnobs.obj)' ou no 'C:\Users\AFCM_\source\repos\OpenSceneGraph-OpenSceneGraph-3.6.0\OpenSceneGraph-OpenSceneGraph-3.6.0\build\bin\osgPlugins-3.6.0\jpeg.pdb'; vinculando objeto quando quando sem nenhuma informaþÒo de depuraþÒo
57>jpeg.lib(jcarith.obj) : warning LNK4099: PDB 'jpeg.pdb' nÒo foi encontrado 'jpeg.lib(jcarith.obj)' ou no 'C:\Users\AFCM_\source\repos\OpenSceneGraph-OpenSceneGraph-3.6.0\OpenSceneGraph-OpenSceneGraph-3.6.0\build\bin\osgPlugins-3.6.0\jpeg.pdb'; vinculando objeto quando quando sem nenhuma informaþÒo de depuraþÒo
57>jpeg.lib(jcprepct.obj) : warning LNK4099: PDB 'jpeg.pdb' nÒo foi encontrado 'jpeg.lib(jcprepct.obj)' ou no 'C:\Users\AFCM_\source\repos\OpenSceneGraph-OpenSceneGraph-3.6.0\OpenSceneGraph-OpenSceneGraph-3.6.0\build\bin\osgPlugins-3.6.0\jpeg.pdb'; vinculando objeto quando quando sem nenhuma informaþÒo de depuraþÒo
57>jpeg.lib(jcsample.obj) : warning LNK4099: PDB 'jpeg.pdb' nÒo foi encontrado 'jpeg.lib(jcsample.obj)' ou no 'C:\Users\AFCM_\source\repos\OpenSceneGraph-OpenSceneGraph-3.6.0\OpenSceneGraph-OpenSceneGraph-3.6.0\build\bin\osgPlugins-3.6.0\jpeg.pdb'; vinculando objeto quando quando sem nenhuma informaþÒo de depuraþÒo
57>jpeg.lib(jcmainct.obj) : warning LNK4099: PDB 'jpeg.pdb' nÒo foi encontrado 'jpeg.lib(jcmainct.obj)' ou no 'C:\Users\AFCM_\source\repos\OpenSceneGraph-OpenSceneGraph-3.6.0\OpenSceneGraph-OpenSceneGraph-3.6.0\build\bin\osgPlugins-3.6.0\jpeg.pdb'; vinculando objeto quando quando sem nenhuma informaþÒo de depuraþÒo
57>jpeg.lib(jcmaster.obj) : warning LNK4099: PDB 'jpeg.pdb' nÒo foi encontrado 'jpeg.lib(jcmaster.obj)' ou no 'C:\Users\AFCM_\source\repos\OpenSceneGraph-OpenSceneGraph-3.6.0\OpenSceneGraph-OpenSceneGraph-3.6.0\build\bin\osgPlugins-3.6.0\jpeg.pdb'; vinculando objeto quando quando sem nenhuma informaþÒo de depuraþÒo
57>jpeg.lib(jccoefct.obj) : warning LNK4099: PDB 'jpeg.pdb' nÒo foi encontrado 'jpeg.lib(jccoefct.obj)' ou no 'C:\Users\AFCM_\source\repos\OpenSceneGraph-OpenSceneGraph-3.6.0\OpenSceneGraph-OpenSceneGraph-3.6.0\build\bin\osgPlugins-3.6.0\jpeg.pdb'; vinculando objeto quando quando sem nenhuma informaþÒo de depuraþÒo
57>jpeg.lib(jccolor.obj) : warning LNK4099: PDB 'jpeg.pdb' nÒo foi encontrado 'jpeg.lib(jccolor.obj)' ou no 'C:\Users\AFCM_\source\repos\OpenSceneGraph-OpenSceneGraph-3.6.0\OpenSceneGraph-OpenSceneGraph-3.6.0\build\bin\osgPlugins-3.6.0\jpeg.pdb'; vinculando objeto quando quando sem nenhuma informaþÒo de depuraþÒo
57>jpeg.lib(jchuff.obj) : warning LNK4099: PDB 'jpeg.pdb' nÒo foi encontrado 'jpeg.lib(jchuff.obj)' ou no 'C:\Users\AFCM_\source\repos\OpenSceneGraph-OpenSceneGraph-3.6.0\OpenSceneGraph-OpenSceneGraph-3.6.0\build\bin\osgPlugins-3.6.0\jpeg.pdb'; vinculando objeto quando quando sem nenhuma informaþÒo de depuraþÒo
57>jpeg.lib(jcdctmgr.obj) : warning LNK4099: PDB 'jpeg.pdb' nÒo foi encontrado 'jpeg.lib(jcdctmgr.obj)' ou no 'C:\Users\AFCM_\source\repos\OpenSceneGraph-OpenSceneGraph-3.6.0\OpenSceneGraph-OpenSceneGraph-3.6.0\build\bin\osgPlugins-3.6.0\jpeg.pdb'; vinculando objeto quando quando sem nenhuma informaþÒo de depuraþÒo
57>jpeg.lib(jquant1.obj) : warning LNK4099: PDB 'jpeg.pdb' nÒo foi encontrado 'jpeg.lib(jquant1.obj)' ou no 'C:\Users\AFCM_\source\repos\OpenSceneGraph-OpenSceneGraph-3.6.0\OpenSceneGraph-OpenSceneGraph-3.6.0\build\bin\osgPlugins-3.6.0\jpeg.pdb'; vinculando objeto quando quando sem nenhuma informaþÒo de depuraþÒo
57>jpeg.lib(jdmerge.obj) : warning LNK4099: PDB 'jpeg.pdb' nÒo foi encontrado 'jpeg.lib(jdmerge.obj)' ou no 'C:\Users\AFCM_\source\repos\OpenSceneGraph-OpenSceneGraph-3.6.0\OpenSceneGraph-OpenSceneGraph-3.6.0\build\bin\osgPlugins-3.6.0\jpeg.pdb'; vinculando objeto quando quando sem nenhuma informaþÒo de depuraþÒo
57>jpeg.lib(jdsample.obj) : warning LNK4099: PDB 'jpeg.pdb' nÒo foi encontrado 'jpeg.lib(jdsample.obj)' ou no 'C:\Users\AFCM_\source\repos\OpenSceneGraph-OpenSceneGraph-3.6.0\OpenSceneGraph-OpenSceneGraph-3.6.0\build\bin\osgPlugins-3.6.0\jpeg.pdb'; vinculando objeto quando quando sem nenhuma informaþÒo de depuraþÒo
57>jpeg.lib(jdhuff.obj) : warning LNK4099: PDB 'jpeg.pdb' nÒo foi encontrado 'jpeg.lib(jdhuff.obj)' ou no 'C:\Users\AFCM_\source\repos\OpenSceneGraph-OpenSceneGraph-3.6.0\OpenSceneGraph-OpenSceneGraph-3.6.0\build\bin\osgPlugins-3.6.0\jpeg.pdb'; vinculando objeto quando quando sem nenhuma informaþÒo de depuraþÒo
57>jpeg.lib(jquant2.obj) : warning LNK4099: PDB 'jpeg.pdb' nÒo foi encontrado 'jpeg.lib(jquant2.obj)' ou no 'C:\Users\AFCM_\source\repos\OpenSceneGraph-OpenSceneGraph-3.6.0\OpenSceneGraph-OpenSceneGraph-3.6.0\build\bin\osgPlugins-3.6.0\jpeg.pdb'; vinculando objeto quando quando sem nenhuma informaþÒo de depuraþÒo
57>jpeg.lib(jdarith.obj) : warning LNK4099: PDB 'jpeg.pdb' nÒo foi encontrado 'jpeg.lib(jdarith.obj)' ou no 'C:\Users\AFCM_\source\repos\OpenSceneGraph-OpenSceneGraph-3.6.0\OpenSceneGraph-OpenSceneGraph-3.6.0\build\bin\osgPlugins-3.6.0\jpeg.pdb'; vinculando objeto quando quando sem nenhuma informaþÒo de depuraþÒo
57>jpeg.lib(jdcoefct.obj) : warning LNK4099: PDB 'jpeg.pdb' nÒo foi encontrado 'jpeg.lib(jdcoefct.obj)' ou no 'C:\Users\AFCM_\source\repos\OpenSceneGraph-OpenSceneGraph-3.6.0\OpenSceneGraph-OpenSceneGraph-3.6.0\build\bin\osgPlugins-3.6.0\jpeg.pdb'; vinculando objeto quando quando sem nenhuma informaþÒo de depuraþÒo
57>jpeg.lib(jdcolor.obj) : warning LNK4099: PDB 'jpeg.pdb' nÒo foi encontrado 'jpeg.lib(jdcolor.obj)' ou no 'C:\Users\AFCM_\source\repos\OpenSceneGraph-OpenSceneGraph-3.6.0\OpenSceneGraph-OpenSceneGraph-3.6.0\build\bin\osgPlugins-3.6.0\jpeg.pdb'; vinculando objeto quando quando sem nenhuma informaþÒo de depuraþÒo
57>jpeg.lib(jdmainct.obj) : warning LNK4099: PDB 'jpeg.pdb' nÒo foi encontrado 'jpeg.lib(jdmainct.obj)' ou no 'C:\Users\AFCM_\source\repos\OpenSceneGraph-OpenSceneGraph-3.6.0\OpenSceneGraph-OpenSceneGraph-3.6.0\build\bin\osgPlugins-3.6.0\jpeg.pdb'; vinculando objeto quando quando sem nenhuma informaþÒo de depuraþÒo
57>jpeg.lib(jddctmgr.obj) : warning LNK4099: PDB 'jpeg.pdb' nÒo foi encontrado 'jpeg.lib(jddctmgr.obj)' ou no 'C:\Users\AFCM_\source\repos\OpenSceneGraph-OpenSceneGraph-3.6.0\OpenSceneGraph-OpenSceneGraph-3.6.0\build\bin\osgPlugins-3.6.0\jpeg.pdb'; vinculando objeto quando quando sem nenhuma informaþÒo de depuraþÒo
57>jpeg.lib(jdpostct.obj) : warning LNK4099: PDB 'jpeg.pdb' nÒo foi encontrado 'jpeg.lib(jdpostct.obj)' ou no 'C:\Users\AFCM_\source\repos\OpenSceneGraph-OpenSceneGraph-3.6.0\OpenSceneGraph-OpenSceneGraph-3.6.0\build\bin\osgPlugins-3.6.0\jpeg.pdb'; vinculando objeto quando quando sem nenhuma informaþÒo de depuraþÒo
57>jpeg.lib(jaricom.obj) : warning LNK4099: PDB 'jpeg.pdb' nÒo foi encontrado 'jpeg.lib(jaricom.obj)' ou no 'C:\Users\AFCM_\source\repos\OpenSceneGraph-OpenSceneGraph-3.6.0\OpenSceneGraph-OpenSceneGraph-3.6.0\build\bin\osgPlugins-3.6.0\jpeg.pdb'; vinculando objeto quando quando sem nenhuma informaþÒo de depuraþÒo
57>jpeg.lib(jfdctint.obj) : warning LNK4099: PDB 'jpeg.pdb' nÒo foi encontrado 'jpeg.lib(jfdctint.obj)' ou no 'C:\Users\AFCM_\source\repos\OpenSceneGraph-OpenSceneGraph-3.6.0\OpenSceneGraph-OpenSceneGraph-3.6.0\build\bin\osgPlugins-3.6.0\jpeg.pdb'; vinculando objeto quando quando sem nenhuma informaþÒo de depuraþÒo
57>jpeg.lib(jfdctfst.obj) : warning LNK4099: PDB 'jpeg.pdb' nÒo foi encontrado 'jpeg.lib(jfdctfst.obj)' ou no 'C:\Users\AFCM_\source\repos\OpenSceneGraph-OpenSceneGraph-3.6.0\OpenSceneGraph-OpenSceneGraph-3.6.0\build\bin\osgPlugins-3.6.0\jpeg.pdb'; vinculando objeto quando quando sem nenhuma informaþÒo de depuraþÒo
57>jpeg.lib(jfdctflt.obj) : warning LNK4099: PDB 'jpeg.pdb' nÒo foi encontrado 'jpeg.lib(jfdctflt.obj)' ou no 'C:\Users\AFCM_\source\repos\OpenSceneGraph-OpenSceneGraph-3.6.0\OpenSceneGraph-OpenSceneGraph-3.6.0\build\bin\osgPlugins-3.6.0\jpeg.pdb'; vinculando objeto quando quando sem nenhuma informaþÒo de depuraþÒo
57>jpeg.lib(jidctint.obj) : warning LNK4099: PDB 'jpeg.pdb' nÒo foi encontrado 'jpeg.lib(jidctint.obj)' ou no 'C:\Users\AFCM_\source\repos\OpenSceneGraph-OpenSceneGraph-3.6.0\OpenSceneGraph-OpenSceneGraph-3.6.0\build\bin\osgPlugins-3.6.0\jpeg.pdb'; vinculando objeto quando quando sem nenhuma informaþÒo de depuraþÒo
57>jpeg.lib(jidctfst.obj) : warning LNK4099: PDB 'jpeg.pdb' nÒo foi encontrado 'jpeg.lib(jidctfst.obj)' ou no 'C:\Users\AFCM_\source\repos\OpenSceneGraph-OpenSceneGraph-3.6.0\OpenSceneGraph-OpenSceneGraph-3.6.0\build\bin\osgPlugins-3.6.0\jpeg.pdb'; vinculando objeto quando quando sem nenhuma informaþÒo de depuraþÒo
57>jpeg.lib(jidctflt.obj) : warning LNK4099: PDB 'jpeg.pdb' nÒo foi encontrado 'jpeg.lib(jidctflt.obj)' ou no 'C:\Users\AFCM_\source\repos\OpenSceneGraph-OpenSceneGraph-3.6.0\OpenSceneGraph-OpenSceneGraph-3.6.0\build\bin\osgPlugins-3.6.0\jpeg.pdb'; vinculando objeto quando quando sem nenhuma informaþÒo de depuraþÒo
71>osgdb_osg.vcxproj -> C:\Users\AFCM_\source\repos\OpenSceneGraph-OpenSceneGraph-3.6.0\OpenSceneGraph-OpenSceneGraph-3.6.0\build\bin\osgPlugins-3.6.0\osgdb_osgd.dll
73>------ Compilação iniciada: Projeto: Plugins osgjs, Configuração: Debug x64 ------
57>osgdb_jpeg.vcxproj -> C:\Users\AFCM_\source\repos\OpenSceneGraph-OpenSceneGraph-3.6.0\OpenSceneGraph-OpenSceneGraph-3.6.0\build\bin\osgPlugins-3.6.0\osgdb_jpegd.dll
57>Projeto de compilação pronto "osgdb_jpeg.vcxproj".
74>------ Compilação iniciada: Projeto: Plugins osgshadow, Configuração: Debug x64 ------
51>Gerando Código...
72>osgdb_osga.vcxproj -> C:\Users\AFCM_\source\repos\OpenSceneGraph-OpenSceneGraph-3.6.0\OpenSceneGraph-OpenSceneGraph-3.6.0\build\bin\osgPlugins-3.6.0\osgdb_osgad.dll
75>------ Compilação iniciada: Projeto: Plugins osgterrain, Configuração: Debug x64 ------
74>osgdb_osgshadow.vcxproj -> C:\Users\AFCM_\source\repos\OpenSceneGraph-OpenSceneGraph-3.6.0\OpenSceneGraph-OpenSceneGraph-3.6.0\build\bin\osgPlugins-3.6.0\osgdb_osgshadowd.dll
76>------ Compilação iniciada: Projeto: Plugins osgtgz, Configuração: Debug x64 ------
73>osgdb_osgjs.vcxproj -> C:\Users\AFCM_\source\repos\OpenSceneGraph-OpenSceneGraph-3.6.0\OpenSceneGraph-OpenSceneGraph-3.6.0\build\bin\osgPlugins-3.6.0\osgdb_osgjsd.dll
77>------ Compilação iniciada: Projeto: Plugins osgviewer, Configuração: Debug x64 ------
75>osgdb_osgterrain.vcxproj -> C:\Users\AFCM_\source\repos\OpenSceneGraph-OpenSceneGraph-3.6.0\OpenSceneGraph-OpenSceneGraph-3.6.0\build\bin\osgPlugins-3.6.0\osgdb_osgterraind.dll
78>------ Compilação iniciada: Projeto: Plugins p3d, Configuração: Debug x64 ------
66>osgdb_nvtt.vcxproj -> C:\Users\AFCM_\source\repos\OpenSceneGraph-OpenSceneGraph-3.6.0\OpenSceneGraph-OpenSceneGraph-3.6.0\build\bin\osgPlugins-3.6.0\osgdb_nvttd.dll
79>------ Compilação iniciada: Projeto: Plugins pic, Configuração: Debug x64 ------
76>osgdb_osgtgz.vcxproj -> C:\Users\AFCM_\source\repos\OpenSceneGraph-OpenSceneGraph-3.6.0\OpenSceneGraph-OpenSceneGraph-3.6.0\build\bin\osgPlugins-3.6.0\osgdb_osgtgzd.dll
80>------ Compilação iniciada: Projeto: Plugins ply, Configuração: Debug x64 ------
77>osgdb_osgviewer.vcxproj -> C:\Users\AFCM_\source\repos\OpenSceneGraph-OpenSceneGraph-3.6.0\OpenSceneGraph-OpenSceneGraph-3.6.0\build\bin\osgPlugins-3.6.0\osgdb_osgviewerd.dll
81>------ Compilação iniciada: Projeto: Plugins png, Configuração: Debug x64 ------
81>Building Custom Rule C:/Users/AFCM_/source/repos/OpenSceneGraph-OpenSceneGraph-3.6.0/OpenSceneGraph-OpenSceneGraph-3.6.0/src/osgPlugins/png/CMakeLists.txt
81>CMake does not need to re-run because C:/Users/AFCM_/source/repos/OpenSceneGraph-OpenSceneGraph-3.6.0/OpenSceneGraph-OpenSceneGraph-3.6.0/build/src/osgPlugins/png/CMakeFiles/generate.stamp is up-to-date.
51> Criando biblioteca C:/Users/AFCM_/source/repos/OpenSceneGraph-OpenSceneGraph-3.6.0/OpenSceneGraph-OpenSceneGraph-3.6.0/build/lib/osgPlugins-3.6.0/osgdb_gdald.lib e objeto C:/Users/AFCM_/source/repos/OpenSceneGraph-OpenSceneGraph-3.6.0/OpenSceneGraph-OpenSceneGraph-3.6.0/build/lib/osgPlugins-3.6.0/osgdb_gdald.exp
81>ReaderWriterPNG.cpp
56>AnimationPath.cpp
79>osgdb_pic.vcxproj -> C:\Users\AFCM_\source\repos\OpenSceneGraph-OpenSceneGraph-3.6.0\OpenSceneGraph-OpenSceneGraph-3.6.0\build\bin\osgPlugins-3.6.0\osgdb_picd.dll
78>osgdb_p3d.vcxproj -> C:\Users\AFCM_\source\repos\OpenSceneGraph-OpenSceneGraph-3.6.0\OpenSceneGraph-OpenSceneGraph-3.6.0\build\bin\osgPlugins-3.6.0\osgdb_p3dd.dll
82>------ Compilação iniciada: Projeto: Plugins pnm, Configuração: Debug x64 ------
83>------ Compilação iniciada: Projeto: Plugins pov, Configuração: Debug x64 ------
80>osgdb_ply.vcxproj -> C:\Users\AFCM_\source\repos\OpenSceneGraph-OpenSceneGraph-3.6.0\OpenSceneGraph-OpenSceneGraph-3.6.0\build\bin\osgPlugins-3.6.0\osgdb_plyd.dll
84>------ Compilação iniciada: Projeto: Plugins pvr, Configuração: Debug x64 ------
51>osgdb_gdal.vcxproj -> C:\Users\AFCM_\source\repos\OpenSceneGraph-OpenSceneGraph-3.6.0\OpenSceneGraph-OpenSceneGraph-3.6.0\build\bin\osgPlugins-3.6.0\osgdb_gdald.dll
85>------ Compilação iniciada: Projeto: Plugins revisions, Configuração: Debug x64 ------
82>osgdb_pnm.vcxproj -> C:\Users\AFCM_\source\repos\OpenSceneGraph-OpenSceneGraph-3.6.0\OpenSceneGraph-OpenSceneGraph-3.6.0\build\bin\osgPlugins-3.6.0\osgdb_pnmd.dll
84>osgdb_pvr.vcxproj -> C:\Users\AFCM_\source\repos\OpenSceneGraph-OpenSceneGraph-3.6.0\OpenSceneGraph-OpenSceneGraph-3.6.0\build\bin\osgPlugins-3.6.0\osgdb_pvrd.dll
86>------ Compilação iniciada: Projeto: Plugins rgb, Configuração: Debug x64 ------
87>------ Compilação iniciada: Projeto: Plugins rot, Configuração: Debug x64 ------
85>osgdb_revisions.vcxproj -> C:\Users\AFCM_\source\repos\OpenSceneGraph-OpenSceneGraph-3.6.0\OpenSceneGraph-OpenSceneGraph-3.6.0\build\bin\osgPlugins-3.6.0\osgdb_revisionsd.dll
88>------ Compilação iniciada: Projeto: Plugins scale, Configuração: Debug x64 ------
89>------ Compilação iniciada: Projeto: Plugins osg serializer osg, Configuração: Debug x64 ------
90>------ Compilação iniciada: Projeto: Plugins osg serializer osganimation, Configuração: Debug x64 ------
90>C:\Program Files (x86)\Microsoft Visual Studio\2017\Community\Common7\IDE\VC\VCTargets\Microsoft.CppBuild.targets(321,5): error MSB3491: Não foi possível gravar linhas no arquivo "osgdb_serializers_osganimation.dir\Debug\Plugins .BC34A2F6.tlog\Plugins osg serializer osganimation.lastbuildstate". O caminho e nome de ficheiro especificados, ou ambos, são demasiado grandes. O nome de ficheiro totalmente qualificado tem de ser inferior a 260 caracteres e o nome do directório tem de ser inferior a 248 caracteres.
90>Projeto de compilação pronto "osgdb_serializers_osganimation.vcxproj" -- FALHA.
91>------ Compilação iniciada: Projeto: Plugins osg serializer osgfx, Configuração: Debug x64 ------
86>osgdb_rgb.vcxproj -> C:\Users\AFCM_\source\repos\OpenSceneGraph-OpenSceneGraph-3.6.0\OpenSceneGraph-OpenSceneGraph-3.6.0\build\bin\osgPlugins-3.6.0\osgdb_rgbd.dll
92>------ Compilação iniciada: Projeto: Plugins osg serializer osgga, Configuração: Debug x64 ------
87>osgdb_rot.vcxproj -> C:\Users\AFCM_\source\repos\OpenSceneGraph-OpenSceneGraph-3.6.0\OpenSceneGraph-OpenSceneGraph-3.6.0\build\bin\osgPlugins-3.6.0\osgdb_rotd.dll
93>------ Compilação iniciada: Projeto: Plugins osg serializer osgmanipulator, Configuração: Debug x64 ------
93>C:\Program Files (x86)\Microsoft Visual Studio\2017\Community\Common7\IDE\VC\VCTargets\Microsoft.CppBuild.targets(321,5): error MSB3491: Não foi possível gravar linhas no arquivo "osgdb_serializers_osgmanipulator.dir\Debug\Plugins .D2061F02.tlog\Plugins osg serializer osgmanipulator.lastbuildstate". O caminho e nome de ficheiro especificados, ou ambos, são demasiado grandes. O nome de ficheiro totalmente qualificado tem de ser inferior a 260 caracteres e o nome do directório tem de ser inferior a 248 caracteres.
93>Projeto de compilação pronto "osgdb_serializers_osgmanipulator.vcxproj" -- FALHA.
88>osgdb_scale.vcxproj -> C:\Users\AFCM_\source\repos\OpenSceneGraph-OpenSceneGraph-3.6.0\OpenSceneGraph-OpenSceneGraph-3.6.0\build\bin\osgPlugins-3.6.0\osgdb_scaled.dll
94>------ Compilação iniciada: Projeto: Plugins osg serializer osgparticle, Configuração: Debug x64 ------
95>------ Compilação iniciada: Projeto: Plugins osg serializer osgshadow, Configuração: Debug x64 ------
91>osgdb_serializers_osgfx.vcxproj -> C:\Users\AFCM_\source\repos\OpenSceneGraph-OpenSceneGraph-3.6.0\OpenSceneGraph-OpenSceneGraph-3.6.0\build\bin\osgPlugins-3.6.0\osgdb_serializers_osgfxd.dll
96>------ Compilação iniciada: Projeto: Plugins osg serializer osgsim, Configuração: Debug x64 ------
92>osgdb_serializers_osgga.vcxproj -> C:\Users\AFCM_\source\repos\OpenSceneGraph-OpenSceneGraph-3.6.0\OpenSceneGraph-OpenSceneGraph-3.6.0\build\bin\osgPlugins-3.6.0\osgdb_serializers_osggad.dll
97>------ Compilação iniciada: Projeto: Plugins osg serializer osgterrain, Configuração: Debug x64 ------
95>osgdb_serializers_osgshadow.vcxproj -> C:\Users\AFCM_\source\repos\OpenSceneGraph-OpenSceneGraph-3.6.0\OpenSceneGraph-OpenSceneGraph-3.6.0\build\bin\osgPlugins-3.6.0\osgdb_serializers_osgshadowd.dll
98>------ Compilação iniciada: Projeto: Plugins osg serializer osgtext, Configuração: Debug x64 ------
96>osgdb_serializers_osgsim.vcxproj -> C:\Users\AFCM_\source\repos\OpenSceneGraph-OpenSceneGraph-3.6.0\OpenSceneGraph-OpenSceneGraph-3.6.0\build\bin\osgPlugins-3.6.0\osgdb_serializers_osgsimd.dll
99>------ Compilação iniciada: Projeto: Plugins osg serializer osgui, Configuração: Debug x64 ------
94>osgdb_serializers_osgparticle.vcxproj -> C:\Users\AFCM_\source\repos\OpenSceneGraph-OpenSceneGraph-3.6.0\OpenSceneGraph-OpenSceneGraph-3.6.0\build\bin\osgPlugins-3.6.0\osgdb_serializers_osgparticled.dll
97>osgdb_serializers_osgterrain.vcxproj -> C:\Users\AFCM_\source\repos\OpenSceneGraph-OpenSceneGraph-3.6.0\OpenSceneGraph-OpenSceneGraph-3.6.0\build\bin\osgPlugins-3.6.0\osgdb_serializers_osgterraind.dll
100>------ Compilação iniciada: Projeto: Plugins osg serializer osgutil, Configuração: Debug x64 ------
101>------ Compilação iniciada: Projeto: Plugins osg serializer osgviewer, Configuração: Debug x64 ------
102>------ Compilação iniciada: Projeto: Plugins osg serializer osgvolume, Configuração: Debug x64 ------
99>osgdb_serializers_osgui.vcxproj -> C:\Users\AFCM_\source\repos\OpenSceneGraph-OpenSceneGraph-3.6.0\OpenSceneGraph-OpenSceneGraph-3.6.0\build\bin\osgPlugins-3.6.0\osgdb_serializers_osguid.dll
103>------ Compilação iniciada: Projeto: Plugins shp, Configuração: Debug x64 ------
100>osgdb_serializers_osgutil.vcxproj -> C:\Users\AFCM_\source\repos\OpenSceneGraph-OpenSceneGraph-3.6.0\OpenSceneGraph-OpenSceneGraph-3.6.0\build\bin\osgPlugins-3.6.0\osgdb_serializers_osgutild.dll
104>------ Compilação iniciada: Projeto: Plugins stl, Configuração: Debug x64 ------
101>osgdb_serializers_osgviewer.vcxproj -> C:\Users\AFCM_\source\repos\OpenSceneGraph-OpenSceneGraph-3.6.0\OpenSceneGraph-OpenSceneGraph-3.6.0\build\bin\osgPlugins-3.6.0\osgdb_serializers_osgviewerd.dll
105>------ Compilação iniciada: Projeto: Plugins tf, Configuração: Debug x64 ------
106>------ Compilação iniciada: Projeto: Plugins tga, Configuração: Debug x64 ------
56>AnisotropicLighting.cpp
102>osgdb_serializers_osgvolume.vcxproj -> C:\Users\AFCM_\source\repos\OpenSceneGraph-OpenSceneGraph-3.6.0\OpenSceneGraph-OpenSceneGraph-3.6.0\build\bin\osgPlugins-3.6.0\osgdb_serializers_osgvolumed.dll
107>------ Compilação iniciada: Projeto: Plugins tgz, Configuração: Debug x64 ------
103>osgdb_shp.vcxproj -> C:\Users\AFCM_\source\repos\OpenSceneGraph-OpenSceneGraph-3.6.0\OpenSceneGraph-OpenSceneGraph-3.6.0\build\bin\osgPlugins-3.6.0\osgdb_shpd.dll
108>------ Compilação iniciada: Projeto: Plugins tiff, Configuração: Debug x64 ------
104>osgdb_stl.vcxproj -> C:\Users\AFCM_\source\repos\OpenSceneGraph-OpenSceneGraph-3.6.0\OpenSceneGraph-OpenSceneGraph-3.6.0\build\bin\osgPlugins-3.6.0\osgdb_stld.dll
81>osgdb_png.vcxproj -> C:\Users\AFCM_\source\repos\OpenSceneGraph-OpenSceneGraph-3.6.0\OpenSceneGraph-OpenSceneGraph-3.6.0\build\bin\osgPlugins-3.6.0\osgdb_pngd.dll
106>osgdb_tga.vcxproj -> C:\Users\AFCM_\source\repos\OpenSceneGraph-OpenSceneGraph-3.6.0\OpenSceneGraph-OpenSceneGraph-3.6.0\build\bin\osgPlugins-3.6.0\osgdb_tgad.dll
105>osgdb_tf.vcxproj -> C:\Users\AFCM_\source\repos\OpenSceneGraph-OpenSceneGraph-3.6.0\OpenSceneGraph-OpenSceneGraph-3.6.0\build\bin\osgPlugins-3.6.0\osgdb_tfd.dll
109>------ Compilação iniciada: Projeto: Plugins trans, Configuração: Debug x64 ------
108>Building Custom Rule C:/Users/AFCM_/source/repos/OpenSceneGraph-OpenSceneGraph-3.6.0/OpenSceneGraph-OpenSceneGraph-3.6.0/src/osgPlugins/tiff/CMakeLists.txt
108>CMake does not need to re-run because C:/Users/AFCM_/source/repos/OpenSceneGraph-OpenSceneGraph-3.6.0/OpenSceneGraph-OpenSceneGraph-3.6.0/build/src/osgPlugins/tiff/CMakeFiles/generate.stamp is up-to-date.
108>ReaderWriterTIFF.cpp
107>osgdb_tgz.vcxproj -> C:\Users\AFCM_\source\repos\OpenSceneGraph-OpenSceneGraph-3.6.0\OpenSceneGraph-OpenSceneGraph-3.6.0\build\bin\osgPlugins-3.6.0\osgdb_tgzd.dll
109>osgdb_trans.vcxproj -> C:\Users\AFCM_\source\repos\OpenSceneGraph-OpenSceneGraph-3.6.0\OpenSceneGraph-OpenSceneGraph-3.6.0\build\bin\osgPlugins-3.6.0\osgdb_transd.dll
56>AutoTransform.cpp
108>osgdb_tiff.vcxproj -> C:\Users\AFCM_\source\repos\OpenSceneGraph-OpenSceneGraph-3.6.0\OpenSceneGraph-OpenSceneGraph-3.6.0\build\bin\osgPlugins-3.6.0\osgdb_tiffd.dll
56>AzimElevationSector.cpp
56>AzimSector.cpp
56>Billboard.cpp
56>BlendColor.cpp
56>BlendEquation.cpp
56>BlendFunc.cpp
56>BlinkSequence.cpp
56>BumpMapping.cpp
56>Camera.cpp
56>CameraView.cpp
56>Cartoon.cpp
56>ClipNode.cpp
56>ClipPlane.cpp
56>ClusterCullingCallback.cpp
56>ColorMask.cpp
56>Gerando Código...
56>Compilando...
56>CompositeLayer.cpp
56>ConeSector.cpp
56>ConvexPlanarOccluder.cpp
56>ConvexPlanarPolygon.cpp
56>CoordinateSystemNode.cpp
56>CullFace.cpp
56>DataInputStream.cpp
56>DataOutputStream.cpp
56>Depth.cpp
56>DirectionalSector.cpp
56>DOFTransform.cpp
56>Drawable.cpp
56>DrawArrayLengths.cpp
56>DrawArrays.cpp
56>DrawElementsUByte.cpp
56>DrawElementsUInt.cpp
56>DrawElementsUShort.cpp
56>Effect.cpp
56>ElevationSector.cpp
56>EllipsoidModel.cpp
56>Gerando Código...
56>Compilando...
56>Exception.cpp
56>FadeText.cpp
56>Fog.cpp
56>FragmentProgram.cpp
56>FrontFace.cpp
56>Geode.cpp
56>Geometry.cpp
56>Group.cpp
56>HeightFieldLayer.cpp
56>Image.cpp
56>ImageLayer.cpp
56>ImageSequence.cpp
56>Impostor.cpp
56>Layer.cpp
56>Light.cpp
56>LightModel.cpp
56>LightPoint.cpp
56>LightPointNode.cpp
56>LightSource.cpp
56>LineStipple.cpp
56>Gerando Código...
56>Compilando...
56>LineWidth.cpp
56>Locator.cpp
56>LOD.cpp
56>Material.cpp
56>MatrixTransform.cpp
56>Multisample.cpp
56>MultiSwitch.cpp
56>MultiTextureControl.cpp
56>Node.cpp
56>Object.cpp
56>OccluderNode.cpp
56>OcclusionQueryNode.cpp
56>PagedLOD.cpp
56>Point.cpp
56>PointSprite.cpp
56>PolygonMode.cpp
56>PolygonOffset.cpp
56>PolygonStipple.cpp
56>PositionAttitudeTransform.cpp
56>PrimitiveSet.cpp
56>Gerando Código...
56>Compilando...
56>Program.cpp
56>ProxyNode.cpp
56>ReaderWriterIVE.cpp
56>Scissor.cpp
56>Scribe.cpp
56>Sequence.cpp
56>ShadeModel.cpp
56>Shader.cpp
56>ShapeAttributeList.cpp
56>Shape.cpp
56>ShapeDrawable.cpp
56>SpecularHighlights.cpp
56>StateSet.cpp
56>Stencil.cpp
56>StencilTwoSided.cpp
56>Switch.cpp
56>SwitchLayer.cpp
56>Terrain.cpp
56>TerrainTile.cpp
56>TexEnvCombine.cpp
56>Gerando Código...
56>Compilando...
56>TexEnv.cpp
56>TexGen.cpp
56>TexGenNode.cpp
56>TexMat.cpp
56>Text3D.cpp
56>Text.cpp
56>Texture1D.cpp
56>Texture2D.cpp
56>Texture2DArray.cpp
56>Texture3D.cpp
56>Texture.cpp
56>TextureCubeMap.cpp
56>TextureRectangle.cpp
56>Transform.cpp
56>Uniform.cpp
56>VertexProgram.cpp
56>Viewport.cpp
56>VisibilityGroup.cpp
56>VolumeCompositeLayer.cpp
56>VolumeCompositeProperty.cpp
56>Gerando Código...
56>Compilando...
56>VolumeSwitchProperty.cpp
56>VolumeScalarProperty.cpp
56>VolumeTransferFunctionProperty.cpp
56>VolumePropertyAdjustmentCallback.cpp
56>Volume.cpp
56>VolumeImageLayer.cpp
56>VolumeLayer.cpp
56>VolumeLocator.cpp
56>VolumeTile.cpp
56>Gerando Código...
17>osgdb_zip.vcxproj -> C:\Users\AFCM_\source\repos\OpenSceneGraph-OpenSceneGraph-3.6.0\OpenSceneGraph-OpenSceneGraph-3.6.0\build\bin\osgPlugins-3.6.0\osgdb_zipd.dll
56>osgdb_ive.vcxproj -> C:\Users\AFCM_\source\repos\OpenSceneGraph-OpenSceneGraph-3.6.0\OpenSceneGraph-OpenSceneGraph-3.6.0\build\bin\osgPlugins-3.6.0\osgdb_ived.dll
110>------ Co
Back to top
View user's profile Send private message
ravidavi
User


Joined: 06 Nov 2015
Posts: 43

PostPosted: Thu Apr 19, 2018 6:40 pm    Post subject:
Building OpenSceneGraph-3.6.0 on Windows 10 with VS2017
Reply with quote

Things you are doing wrong in CMake:
  • Do NOT change CMAKE_INCLUDE_PATH or CMAKE_LIBRARY_PATH.
  • Set ACTUAL_3RDPARTY_DIR to the path to 3rd-party x64 folder (containing bin, include, lib, etc). It will be something like C:pathto3rdParty_x64x64
  • If your ACTUAL_3RDPARTY_DIR is set correctly, then all the dependencies should be found automatically. You shouldn't have to mess with CMAKE_* variables to find them.
  • Set CMAKE_INSTALL_PREFIX to some location you have access to. Your INSTALL step says "file cannot create directory: C:/ProgramFiles/OpenSceneGraph/lib/pkgconfig. Maybe need administrative privileges." You clearly don't have Admin privileges.
  • If you really do want to install OSG to C:ProgramFiles, then run Visual Studio in Administrator mode.
Things you *might* be doing wrong in CMake:
  • Make sure you are building out-of-source, e.g. "Where is the source code" and "Where to build the binaries" should not be the same folder in CMake-GUI. I always make the build folder a sub-directory of the source folder.
Make sure you delete your current build folder, since you've already messed with things too much to fix. Delete the folder, start CMake from scratch, and follow the above guidelines.


Ravi

On Thu, Apr 19, 2018 at 12:44 PM, André Martins < (
Only registered users can see emails on this board!
Get registred or enter the forums!
)> wrote:
Quote:
Hi,
I would like to request some help since I've been unable to build the project using CMake and VS2017.
It's my first time building such a huge project and seems overwhelming at first.
I tried searching online, in the forum and in the openscenegraph website but none of the options worked...

What I've done:

Downloaded the source code from:
github .com/openscenegraph/OpenSceneGraph/tree/OpenSceneGraph-3.6.0

Downloaded dependencies from:
download.osgvisual .org/3rdParty_VS2017_v141_x64_V11_full.7z

CmakeSetup on Cmake 3.11.1:
Visual Studio 15 2014 Win64
Use default native compilers



Upon CMake Generation I edited CMAKE_INCLUDE_PATH and CMAKE_LIBRARY_PATH to match the dependencies include and lib folders, respectively.
I also updated SLD2_INCLUDE_DIR AND SDL2_LIBRARY_LIB sinca I had already compiled SDL2 previously.
Here's the output:



Code:
CMake Deprecation Warning at CMakeLists.txt:40 (cmake_policy):
  The OLD behavior for policy CMP0008 will be removed from a future version
  of CMake.

  The cmake-policies(7) manual explains that the OLD behaviors of all
  policies are deprecated and that a policy should be set to OLD only under
  specific short-term circumstances.  Projects should be ported to the NEW
  behavior and not rely on setting a policy to OLD.


Could NOT find EGL (missing: EGL_LIBRARY EGL_INCLUDE_DIR)
Checking windows version...
64 bit architecture detected
Could NOT find Freetype (missing: FREETYPE_LIBRARY) (found version "2.7.1")
Could NOT find Jasper (missing: JASPER_LIBRARIES JASPER_INCLUDE_DIR)
Could NOT find PkgConfig (missing: PKG_CONFIG_EXECUTABLE)
Trying to find DCMTK expecting DCMTKConfig.cmake
Trying to find DCMTK expecting DCMTKConfig.cmake - failed
Trying to find DCMTK relying on FindDCMTK.cmake
Please set DCMTK_DIR and re-run configure (missing: DCMTK_config_INCLUDE_DIR DCMTK_dcmdata_INCLUDE_DIR DCMTK_dcmimage_INCLUDE_DIR DCMTK_dcmimgle_INCLUDE_DIR DCMTK_dcmjpeg_INCLUDE_DIR DCMTK_dcmjpls_INCLUDE_DIR DCMTK_dcmnet_INCLUDE_DIR DCMTK_dcmpstat_INCLUDE_DIR DCMTK_dcmqrdb_INCLUDE_DIR DCMTK_dcmsign_INCLUDE_DIR DCMTK_dcmsr_INCLUDE_DIR DCMTK_dcmtls_INCLUDE_DIR DCMTK_ofstd_INCLUDE_DIR DCMTK_oflog_INCLUDE_DIR)
Trying to find DCMTK relying on FindDCMTK.cmake - ok
Could NOT find GStreamer (missing: GSTREAMER_INCLUDE_DIRS GSTREAMER_LIBRARIES GSTREAMER_VERSION GSTREAMER_BASE_INCLUDE_DIRS GSTREAMER_BASE_LIBRARIES GSTREAMER_APP_INCLUDE_DIRS GSTREAMER_APP_LIBRARIES GSTREAMER_PBUTILS_INCLUDE_DIRS GSTREAMER_PBUTILS_LIBRARIES)
Could NOT find SDL (missing: SDL_LIBRARY SDL_INCLUDE_DIR)
Could NOT find PkgConfig (missing: PKG_CONFIG_EXECUTABLE)
Could NOT find PkgConfig (missing: PKG_CONFIG_EXECUTABLE)
Could NOT find PkgConfig (missing: PKG_CONFIG_EXECUTABLE)
Configuring done
Generating done





After that I opened the solution on VS2017 and built ALL_BUILD

Heres the result:

Code:

1>------ Compilação iniciada: Projeto: ZERO_CHECK, Configuração: Debug x64 ------
2>------ Compilação iniciada: Projeto: osgDB, Configuração: Debug x64 ------
2>ObjectWrapper.cpp
2>InputStream.cpp
2>OutputStream.cpp
2>Compressors.cpp
2>Archive.cpp
2>AuthenticationMap.cpp
2>Callbacks.cpp
2>ClassInterface.cpp
2>ConvertBase64.cpp
2>ConvertUTF.cpp
2>DatabasePager.cpp
2>DatabaseRevisions.cpp
2>DotOsgWrapper.cpp
2>DynamicLibrary.cpp
2>ExternalFileWriter.cpp
2>Field.cpp
2>FieldReader.cpp
2>FieldReaderIterator.cpp
2>FileCache.cpp
2>FileNameUtils.cpp
2>Gerando Código...
2>Compilando...
2>FileUtils.cpp
2>fstream.cpp
2>ImageOptions.cpp
2>ImagePager.cpp
2>Input.cpp
2>MimeTypes.cpp
2>ObjectCache.cpp
2>Output.cpp
2>Options.cpp
2>PluginQuery.cpp
2>ReaderWriter.cpp
2>ReadFile.cpp
2>Registry.cpp
2>SharedStateManager.cpp
2>StreamOperator.cpp
2>Version.cpp
2>WriteFile.cpp
2>XmlParser.cpp
2>Gerando Código...
2>   Criando biblioteca C:/Users/AFCM_/source/repos/OpenSceneGraph-OpenSceneGraph-3.6.0/OpenSceneGraph-OpenSceneGraph-3.6.0/build/lib/osgDBd.lib e objeto C:/Users/AFCM_/source/repos/OpenSceneGraph-OpenSceneGraph-3.6.0/OpenSceneGraph-OpenSceneGraph-3.6.0/build/lib/osgDBd.exp
2>osgDB.vcxproj -> C:UsersAFCM_sourcereposOpenSceneGraph-OpenSceneGraph-3.6.0OpenSceneGraph-OpenSceneGraph-3.6.0buildbinosg156-osgDBd.dll
3>------ Compilação iniciada: Projeto: osgText, Configuração: Debug x64 ------
4>------ Compilação iniciada: Projeto: osgGA, Configuração: Debug x64 ------
5>------ Compilação iniciada: Projeto: osgFX, Configuração: Debug x64 ------
6>------ Compilação iniciada: Projeto: osgParticle, Configuração: Debug x64 ------
7>------ Compilação iniciada: Projeto: osgShadow, Configuração: Debug x64 ------
8>------ Compilação iniciada: Projeto: osgTerrain, Configuração: Debug x64 ------
9>------ Compilação iniciada: Projeto: Plugins trk, Configuração: Debug x64 ------
10>------ Compilação iniciada: Projeto: Plugins vtf, Configuração: Debug x64 ------
5>   Criando biblioteca C:/Users/AFCM_/source/repos/OpenSceneGraph-OpenSceneGraph-3.6.0/OpenSceneGraph-OpenSceneGraph-3.6.0/build/lib/osgFXd.lib e objeto C:/Users/AFCM_/source/repos/OpenSceneGraph-OpenSceneGraph-3.6.0/OpenSceneGraph-OpenSceneGraph-3.6.0/build/lib/osgFXd.exp
3>   Criando biblioteca C:/Users/AFCM_/source/repos/OpenSceneGraph-OpenSceneGraph-3.6.0/OpenSceneGraph-OpenSceneGraph-3.6.0/build/lib/osgTextd.lib e objeto C:/Users/AFCM_/source/repos/OpenSceneGraph-OpenSceneGraph-3.6.0/OpenSceneGraph-OpenSceneGraph-3.6.0/build/lib/osgTextd.exp
4>   Criando biblioteca C:/Users/AFCM_/source/repos/OpenSceneGraph-OpenSceneGraph-3.6.0/OpenSceneGraph-OpenSceneGraph-3.6.0/build/lib/osgGAd.lib e objeto C:/Users/AFCM_/source/repos/OpenSceneGraph-OpenSceneGraph-3.6.0/OpenSceneGraph-OpenSceneGraph-3.6.0/build/lib/osgGAd.exp
8>   Criando biblioteca C:/Users/AFCM_/source/repos/OpenSceneGraph-OpenSceneGraph-3.6.0/OpenSceneGraph-OpenSceneGraph-3.6.0/build/lib/osgTerraind.lib e objeto C:/Users/AFCM_/source/repos/OpenSceneGraph-OpenSceneGraph-3.6.0/OpenSceneGraph-OpenSceneGraph-3.6.0/build/lib/osgTerraind.exp
6>   Criando biblioteca C:/Users/AFCM_/source/repos/OpenSceneGraph-OpenSceneGraph-3.6.0/OpenSceneGraph-OpenSceneGraph-3.6.0/build/lib/osgParticled.lib e objeto C:/Users/AFCM_/source/repos/OpenSceneGraph-OpenSceneGraph-3.6.0/OpenSceneGraph-OpenSceneGraph-3.6.0/build/lib/osgParticled.exp
7>   Criando biblioteca C:/Users/AFCM_/source/repos/OpenSceneGraph-OpenSceneGraph-3.6.0/OpenSceneGraph-OpenSceneGraph-3.6.0/build/lib/osgShadowd.lib e objeto C:/Users/AFCM_/source/repos/OpenSceneGraph-OpenSceneGraph-3.6.0/OpenSceneGraph-OpenSceneGraph-3.6.0/build/lib/osgShadowd.exp
5>osgFX.vcxproj -> C:UsersAFCM_sourcereposOpenSceneGraph-OpenSceneGraph-3.6.0OpenSceneGraph-OpenSceneGraph-3.6.0buildbinosg156-osgFXd.dll
11>------ Compilação iniciada: Projeto: Plugins x, Configuração: Debug x64 ------
3>osgText.vcxproj -> C:UsersAFCM_sourcereposOpenSceneGraph-OpenSceneGraph-3.6.0OpenSceneGraph-OpenSceneGraph-3.6.0buildbinosg156-osgTextd.dll
9>osgdb_trk.vcxproj -> C:UsersAFCM_sourcereposOpenSceneGraph-OpenSceneGraph-3.6.0OpenSceneGraph-OpenSceneGraph-3.6.0buildbinosgPlugins-3.6.0osgdb_trkd.dll
4>osgGA.vcxproj -> C:UsersAFCM_sourcereposOpenSceneGraph-OpenSceneGraph-3.6.0OpenSceneGraph-OpenSceneGraph-3.6.0buildbinosg156-osgGAd.dll
10>osgdb_vtf.vcxproj -> C:UsersAFCM_sourcereposOpenSceneGraph-OpenSceneGraph-3.6.0OpenSceneGraph-OpenSceneGraph-3.6.0buildbinosgPlugins-3.6.0osgdb_vtfd.dll
8>osgTerrain.vcxproj -> C:UsersAFCM_sourcereposOpenSceneGraph-OpenSceneGraph-3.6.0OpenSceneGraph-OpenSceneGraph-3.6.0buildbinosg156-osgTerraind.dll
6>osgParticle.vcxproj -> C:UsersAFCM_sourcereposOpenSceneGraph-OpenSceneGraph-3.6.0OpenSceneGraph-OpenSceneGraph-3.6.0buildbinosg156-osgParticled.dll
11>osgdb_x.vcxproj -> C:UsersAFCM_sourcereposOpenSceneGraph-OpenSceneGraph-3.6.0OpenSceneGraph-OpenSceneGraph-3.6.0buildbinosgPlugins-3.6.0osgdb_xd.dll
7>osgShadow.vcxproj -> C:UsersAFCM_sourcereposOpenSceneGraph-OpenSceneGraph-3.6.0OpenSceneGraph-OpenSceneGraph-3.6.0buildbinosg156-osgShadowd.dll
12>------ Compilação iniciada: Projeto: Applications osgversion, Configuração: Debug x64 ------
13>------ Compilação iniciada: Projeto: osgViewer, Configuração: Debug x64 ------
14>------ Compilação iniciada: Projeto: osgVolume, Configuração: Debug x64 ------
15>------ Compilação iniciada: Projeto: osgSim, Configuração: Debug x64 ------
16>------ Compilação iniciada: Projeto: Plugins txf, Configuração: Debug x64 ------
17>------ Compilação iniciada: Projeto: Plugins zip, Configuração: Debug x64 ------
18>------ Compilação iniciada: Projeto: Plugins 3dc, Configuração: Debug x64 ------
19>------ Compilação iniciada: Projeto: Plugins 3ds, Configuração: Debug x64 ------
17>Building Custom Rule C:/Users/AFCM_/source/repos/OpenSceneGraph-OpenSceneGraph-3.6.0/OpenSceneGraph-OpenSceneGraph-3.6.0/src/osgPlugins/zip/CMakeLists.txt
17>CMake does not need to re-run because C:/Users/AFCM_/source/repos/OpenSceneGraph-OpenSceneGraph-3.6.0/OpenSceneGraph-OpenSceneGraph-3.6.0/build/src/osgPlugins/zip/CMakeFiles/generate.stamp is up-to-date.
15>   Criando biblioteca C:/Users/AFCM_/source/repos/OpenSceneGraph-OpenSceneGraph-3.6.0/OpenSceneGraph-OpenSceneGraph-3.6.0/build/lib/osgSimd.lib e objeto C:/Users/AFCM_/source/repos/OpenSceneGraph-OpenSceneGraph-3.6.0/OpenSceneGraph-OpenSceneGraph-3.6.0/build/lib/osgSimd.exp
14>   Criando biblioteca C:/Users/AFCM_/source/repos/OpenSceneGraph-OpenSceneGraph-3.6.0/OpenSceneGraph-OpenSceneGraph-3.6.0/build/lib/osgVolumed.lib e objeto C:/Users/AFCM_/source/repos/OpenSceneGraph-OpenSceneGraph-3.6.0/OpenSceneGraph-OpenSceneGraph-3.6.0/build/lib/osgVolumed.exp
17>unzip.cpp
13>   Criando biblioteca C:/Users/AFCM_/source/repos/OpenSceneGraph-OpenSceneGraph-3.6.0/OpenSceneGraph-OpenSceneGraph-3.6.0/build/lib/osgViewerd.lib e objeto C:/Users/AFCM_/source/repos/OpenSceneGraph-OpenSceneGraph-3.6.0/OpenSceneGraph-OpenSceneGraph-3.6.0/build/lib/osgViewerd.exp
12>application_osgversion.vcxproj -> C:UsersAFCM_sourcereposOpenSceneGraph-OpenSceneGraph-3.6.0OpenSceneGraph-OpenSceneGraph-3.6.0buildbinosgversiond.exe
20>------ Compilação iniciada: Projeto: Plugins ac, Configuração: Debug x64 ------
17>ZipArchive.cpp
16>osgdb_txf.vcxproj -> C:UsersAFCM_sourcereposOpenSceneGraph-OpenSceneGraph-3.6.0OpenSceneGraph-OpenSceneGraph-3.6.0buildbinosgPlugins-3.6.0osgdb_txfd.dll
21>------ Compilação iniciada: Projeto: Plugins bmp, Configuração: Debug x64 ------
18>osgdb_3dc.vcxproj -> C:UsersAFCM_sourcereposOpenSceneGraph-OpenSceneGraph-3.6.0OpenSceneGraph-OpenSceneGraph-3.6.0buildbinosgPlugins-3.6.0osgdb_3dcd.dll
22>------ Compilação iniciada: Projeto: Plugins bsp, Configuração: Debug x64 ------
14>osgVolume.vcxproj -> C:UsersAFCM_sourcereposOpenSceneGraph-OpenSceneGraph-3.6.0OpenSceneGraph-OpenSceneGraph-3.6.0buildbinosg156-osgVolumed.dll
19>osgdb_3ds.vcxproj -> C:UsersAFCM_sourcereposOpenSceneGraph-OpenSceneGraph-3.6.0OpenSceneGraph-OpenSceneGraph-3.6.0buildbinosgPlugins-3.6.0osgdb_3dsd.dll
23>------ Compilação iniciada: Projeto: Plugins curl, Configuração: Debug x64 ------
24>------ Compilação iniciada: Projeto: Plugins dds, Configuração: Debug x64 ------
23>Building Custom Rule C:/Users/AFCM_/source/repos/OpenSceneGraph-OpenSceneGraph-3.6.0/OpenSceneGraph-OpenSceneGraph-3.6.0/src/osgPlugins/curl/CMakeLists.txt
23>CMake does not need to re-run because C:/Users/AFCM_/source/repos/OpenSceneGraph-OpenSceneGraph-3.6.0/OpenSceneGraph-OpenSceneGraph-3.6.0/build/src/osgPlugins/curl/CMakeFiles/generate.stamp is up-to-date.
20>osgdb_ac.vcxproj -> C:UsersAFCM_sourcereposOpenSceneGraph-OpenSceneGraph-3.6.0OpenSceneGraph-OpenSceneGraph-3.6.0buildbinosgPlugins-3.6.0osgdb_acd.dll
15>osgSim.vcxproj -> C:UsersAFCM_sourcereposOpenSceneGraph-OpenSceneGraph-3.6.0OpenSceneGraph-OpenSceneGraph-3.6.0buildbinosg156-osgSimd.dll
21>osgdb_bmp.vcxproj -> C:UsersAFCM_sourcereposOpenSceneGraph-OpenSceneGraph-3.6.0OpenSceneGraph-OpenSceneGraph-3.6.0buildbinosgPlugins-3.6.0osgdb_bmpd.dll
25>------ Compilação iniciada: Projeto: Plugins osg deprecated osg, Configuração: Debug x64 ------
26>------ Compilação iniciada: Projeto: Plugins txp, Configuração: Debug x64 ------
13>osgViewer.vcxproj -> C:UsersAFCM_sourcereposOpenSceneGraph-OpenSceneGraph-3.6.0OpenSceneGraph-OpenSceneGraph-3.6.0buildbinosg156-osgViewerd.dll
27>------ Compilação iniciada: Projeto: Plugins osg deprecated osgfx, Configuração: Debug x64 ------
23>ReaderWriterCURL.cpp
28>------ Compilação iniciada: Projeto: osgManipulator, Configuração: Debug x64 ------
22>osgdb_bsp.vcxproj -> C:UsersAFCM_sourcereposOpenSceneGraph-OpenSceneGraph-3.6.0OpenSceneGraph-OpenSceneGraph-3.6.0buildbinosgPlugins-3.6.0osgdb_bspd.dll
29>------ Compilação iniciada: Projeto: osgUI, Configuração: Debug x64 ------
24>osgdb_dds.vcxproj -> C:UsersAFCM_sourcereposOpenSceneGraph-OpenSceneGraph-3.6.0OpenSceneGraph-OpenSceneGraph-3.6.0buildbinosgPlugins-3.6.0osgdb_ddsd.dll
30>------ Compilação iniciada: Projeto: osgWidget, Configuração: Debug x64 ------
28>   Criando biblioteca C:/Users/AFCM_/source/repos/OpenSceneGraph-OpenSceneGraph-3.6.0/OpenSceneGraph-OpenSceneGraph-3.6.0/build/lib/osgManipulatord.lib e objeto C:/Users/AFCM_/source/repos/OpenSceneGraph-OpenSceneGraph-3.6.0/OpenSceneGraph-OpenSceneGraph-3.6.0/build/lib/osgManipulatord.exp
29>   Criando biblioteca C:/Users/AFCM_/source/repos/OpenSceneGraph-OpenSceneGraph-3.6.0/OpenSceneGraph-OpenSceneGraph-3.6.0/build/lib/osgUId.lib e objeto C:/Users/AFCM_/source/repos/OpenSceneGraph-OpenSceneGraph-3.6.0/OpenSceneGraph-OpenSceneGraph-3.6.0/build/lib/osgUId.exp
27>osgdb_deprecated_osgfx.vcxproj -> C:UsersAFCM_sourcereposOpenSceneGraph-OpenSceneGraph-3.6.0OpenSceneGraph-OpenSceneGraph-3.6.0buildbinosgPlugins-3.6.0osgdb_deprecated_osgfxd.dll
31>------ Compilação iniciada: Projeto: osgAnimation, Configuração: Debug x64 ------
30>   Criando biblioteca C:/Users/AFCM_/source/repos/OpenSceneGraph-OpenSceneGraph-3.6.0/OpenSceneGraph-OpenSceneGraph-3.6.0/build/lib/osgWidgetd.lib e objeto C:/Users/AFCM_/source/repos/OpenSceneGraph-OpenSceneGraph-3.6.0/OpenSceneGraph-OpenSceneGraph-3.6.0/build/lib/osgWidgetd.exp
28>osgManipulator.vcxproj -> C:UsersAFCM_sourcereposOpenSceneGraph-OpenSceneGraph-3.6.0OpenSceneGraph-OpenSceneGraph-3.6.0buildbinosg156-osgManipulatord.dll
32>------ Compilação iniciada: Projeto: Applications osgarchive, Configuração: Debug x64 ------
29>osgUI.vcxproj -> C:UsersAFCM_sourcereposOpenSceneGraph-OpenSceneGraph-3.6.0OpenSceneGraph-OpenSceneGraph-3.6.0buildbinosg156-osgUId.dll
33>------ Compilação iniciada: Projeto: Applications osgconv, Configuração: Debug x64 ------
31>   Criando biblioteca C:/Users/AFCM_/source/repos/OpenSceneGraph-OpenSceneGraph-3.6.0/OpenSceneGraph-OpenSceneGraph-3.6.0/build/lib/osgAnimationd.lib e objeto C:/Users/AFCM_/source/repos/OpenSceneGraph-OpenSceneGraph-3.6.0/OpenSceneGraph-OpenSceneGraph-3.6.0/build/lib/osgAnimationd.exp
30>osgWidget.vcxproj -> C:UsersAFCM_sourcereposOpenSceneGraph-OpenSceneGraph-3.6.0OpenSceneGraph-OpenSceneGraph-3.6.0buildbinosg156-osgWidgetd.dll
34>------ Compilação iniciada: Projeto: osgPresentation, Configuração: Debug x64 ------
25>osgdb_deprecated_osg.vcxproj -> C:UsersAFCM_sourcereposOpenSceneGraph-OpenSceneGraph-3.6.0OpenSceneGraph-OpenSceneGraph-3.6.0buildbinosgPlugins-3.6.0osgdb_deprecated_osgd.dll
32>application_osgarchive.vcxproj -> C:UsersAFCM_sourcereposOpenSceneGraph-OpenSceneGraph-3.6.0OpenSceneGraph-OpenSceneGraph-3.6.0buildbinosgarchived.exe
35>------ Compilação iniciada: Projeto: Applications osgfilecache, Configuração: Debug x64 ------
36>------ Compilação iniciada: Projeto: Applications osgviewer, Configuração: Debug x64 ------
33>application_osgconv.vcxproj -> C:UsersAFCM_sourcereposOpenSceneGraph-OpenSceneGraph-3.6.0OpenSceneGraph-OpenSceneGraph-3.6.0buildbinosgconvd.exe
37>------ Compilação iniciada: Projeto: Plugins cfg, Configuração: Debug x64 ------
34>   Criando biblioteca C:/Users/AFCM_/source/repos/OpenSceneGraph-OpenSceneGraph-3.6.0/OpenSceneGraph-OpenSceneGraph-3.6.0/build/lib/osgPresentationd.lib e objeto C:/Users/AFCM_/source/repos/OpenSceneGraph-OpenSceneGraph-3.6.0/OpenSceneGraph-OpenSceneGraph-3.6.0/build/lib/osgPresentationd.exp
31>osgAnimation.vcxproj -> C:UsersAFCM_sourcereposOpenSceneGraph-OpenSceneGraph-3.6.0OpenSceneGraph-OpenSceneGraph-3.6.0buildbinosg156-osgAnimationd.dll
38>------ Compilação iniciada: Projeto: Plugins bvh, Configuração: Debug x64 ------
36>application_osgviewer.vcxproj -> C:UsersAFCM_sourcereposOpenSceneGraph-OpenSceneGraph-3.6.0OpenSceneGraph-OpenSceneGraph-3.6.0buildbinosgviewerd.exe
39>------ Compilação iniciada: Projeto: Plugins osg deprecated osganimation, Configuração: Debug x64 ------
39>C:Program Files (x86)Microsoft Visual Studio2017CommunityCommon7IDEVCVCTargetsMicrosoft.CppBuild.targets(321,5): error MSB3491: Não foi possível gravar linhas no arquivo "osgdb_deprecated_osganimation.dirDebugPlugins .C844942A.tlogPlugins osg deprecated osganimation.lastbuildstate". O caminho e nome de ficheiro especificados, ou ambos, são demasiado grandes. O nome de ficheiro totalmente qualificado tem de ser inferior a 260 caracteres e o nome do directório tem de ser inferior a 248 caracteres.
39>Projeto de compilação pronto "osgdb_deprecated_osganimation.vcxproj" -- FALHA.
40>------ Compilação iniciada: Projeto: Plugins osg deprecated osgparticle, Configuração: Debug x64 ------
40>C:Program Files (x86)Microsoft Visual Studio2017CommunityCommon7IDEVCVCTargetsMicrosoft.CppBuild.targets(321,5): error MSB3491: Não foi possível gravar linhas no arquivo "osgdb_deprecated_osgparticle.dirDebugPlugins .AF305535.tlogPlugins osg deprecated osgparticle.lastbuildstate". O caminho e nome de ficheiro especificados, ou ambos, são demasiado grandes. O nome de ficheiro totalmente qualificado tem de ser inferior a 260 caracteres e o nome do directório tem de ser inferior a 248 caracteres.
40>Projeto de compilação pronto "osgdb_deprecated_osgparticle.vcxproj" -- FALHA.
41>------ Compilação iniciada: Projeto: Plugins osg deprecated osgshadow, Configuração: Debug x64 ------
34>osgPresentation.vcxproj -> C:UsersAFCM_sourcereposOpenSceneGraph-OpenSceneGraph-3.6.0OpenSceneGraph-OpenSceneGraph-3.6.0buildbinosg156-osgPresentationd.dll
37>osgdb_cfg.vcxproj -> C:UsersAFCM_sourcereposOpenSceneGraph-OpenSceneGraph-3.6.0OpenSceneGraph-OpenSceneGraph-3.6.0buildbinosgPlugins-3.6.0osgdb_cfgd.dll
42>------ Compilação iniciada: Projeto: Plugins osg deprecated osgsim, Configuração: Debug x64 ------
17>ReaderWriterZIP.cpp
38>osgdb_bvh.vcxproj -> C:UsersAFCM_sourcereposOpenSceneGraph-OpenSceneGraph-3.6.0OpenSceneGraph-OpenSceneGraph-3.6.0buildbinosgPlugins-3.6.0osgdb_bvhd.dll
43>------ Compilação iniciada: Projeto: Plugins osg deprecated osgterrain, Configuração: Debug x64 ------
43>C:Program Files (x86)Microsoft Visual Studio2017CommunityCommon7IDEVCVCTargetsMicrosoft.CppBuild.targets(321,5): error MSB3491: Não foi possível gravar linhas no arquivo "osgdb_deprecated_osgterrain.dirDebugPlugins .E950791E.tlogPlugins osg deprecated osgterrain.lastbuildstate". O caminho e nome de ficheiro especificados, ou ambos, são demasiado grandes. O nome de ficheiro totalmente qualificado tem de ser inferior a 260 caracteres e o nome do directório tem de ser inferior a 248 caracteres.
43>Projeto de compilação pronto "osgdb_deprecated_osgterrain.vcxproj" -- FALHA.
44>------ Compilação iniciada: Projeto: Plugins osg deprecated osgtext, Configuração: Debug x64 ------
41>osgdb_deprecated_osgshadow.vcxproj -> C:UsersAFCM_sourcereposOpenSceneGraph-OpenSceneGraph-3.6.0OpenSceneGraph-OpenSceneGraph-3.6.0buildbinosgPlugins-3.6.0osgdb_deprecated_osgshadowd.dll
45>------ Compilação iniciada: Projeto: Plugins osg deprecated osgviewer, Configuração: Debug x64 ------
35>application_osgfilecache.vcxproj -> C:UsersAFCM_sourcereposOpenSceneGraph-OpenSceneGraph-3.6.0OpenSceneGraph-OpenSceneGraph-3.6.0buildbinosgfilecached.exe
42>osgdb_deprecated_osgsim.vcxproj -> C:UsersAFCM_sourcereposOpenSceneGraph-OpenSceneGraph-3.6.0OpenSceneGraph-OpenSceneGraph-3.6.0buildbinosgPlugins-3.6.0osgdb_deprecated_osgsimd.dll
46>------ Compilação iniciada: Projeto: Plugins osg deprecated osgvolume, Configuração: Debug x64 ------
44>osgdb_deprecated_osgtext.vcxproj -> C:UsersAFCM_sourcereposOpenSceneGraph-OpenSceneGraph-3.6.0OpenSceneGraph-OpenSceneGraph-3.6.0buildbinosgPlugins-3.6.0osgdb_deprecated_osgtextd.dll
47>------ Compilação iniciada: Projeto: Plugins osg deprecated osgwidget, Configuração: Debug x64 ------
26>osgdb_txp.vcxproj -> C:UsersAFCM_sourcereposOpenSceneGraph-OpenSceneGraph-3.6.0OpenSceneGraph-OpenSceneGraph-3.6.0buildbinosgPlugins-3.6.0osgdb_txpd.dll
45>osgdb_deprecated_osgviewer.vcxproj -> C:UsersAFCM_sourcereposOpenSceneGraph-OpenSceneGraph-3.6.0OpenSceneGraph-OpenSceneGraph-3.6.0buildbinosgPlugins-3.6.0osgdb_deprecated_osgviewerd.dll
48>------ Compilação iniciada: Projeto: Plugins dot, Configuração: Debug x64 ------
49>------ Compilação iniciada: Projeto: Applications present3D, Configuração: Debug x64 ------
50>------ Compilação iniciada: Projeto: Plugins dxf, Configuração: Debug x64 ------
46>osgdb_deprecated_osgvolume.vcxproj -> C:UsersAFCM_sourcereposOpenSceneGraph-OpenSceneGraph-3.6.0OpenSceneGraph-OpenSceneGraph-3.6.0buildbinosgPlugins-3.6.0osgdb_deprecated_osgvolumed.dll
51>------ Compilação iniciada: Projeto: Plugins gdal, Configuração: Debug x64 ------
52>------ Compilação iniciada: Projeto: Plugins gles, Configuração: Debug x64 ------
51>Building Custom Rule C:/Users/AFCM_/source/repos/OpenSceneGraph-OpenSceneGraph-3.6.0/OpenSceneGraph-OpenSceneGraph-3.6.0/src/osgPlugins/gdal/CMakeLists.txt
51>CMake does not need to re-run because C:/Users/AFCM_/source/repos/OpenSceneGraph-OpenSceneGraph-3.6.0/OpenSceneGraph-OpenSceneGraph-3.6.0/build/src/osgPlugins/gdal/CMakeFiles/generate.stamp is up-to-date.
47>osgdb_deprecated_osgwidget.vcxproj -> C:UsersAFCM_sourcereposOpenSceneGraph-OpenSceneGraph-3.6.0OpenSceneGraph-OpenSceneGraph-3.6.0buildbinosgPlugins-3.6.0osgdb_deprecated_osgwidgetd.dll
48>osgdb_dot.vcxproj -> C:UsersAFCM_sourcereposOpenSceneGraph-OpenSceneGraph-3.6.0OpenSceneGraph-OpenSceneGraph-3.6.0buildbinosgPlugins-3.6.0osgdb_dotd.dll
53>------ Compilação iniciada: Projeto: Plugins glsl, Configuração: Debug x64 ------
51>ReaderWriterGDAL.cpp
54>------ Compilação iniciada: Projeto: Plugins gz, Configuração: Debug x64 ------
54>Building Custom Rule C:/Users/AFCM_/source/repos/OpenSceneGraph-OpenSceneGraph-3.6.0/OpenSceneGraph-OpenSceneGraph-3.6.0/src/osgPlugins/gz/CMakeLists.txt
54>CMake does not need to re-run because C:/Users/AFCM_/source/repos/OpenSceneGraph-OpenSceneGraph-3.6.0/OpenSceneGraph-OpenSceneGraph-3.6.0/build/src/osgPlugins/gz/CMakeFiles/generate.stamp is up-to-date.
23>osgdb_curl.vcxproj -> C:UsersAFCM_sourcereposOpenSceneGraph-OpenSceneGraph-3.6.0OpenSceneGraph-OpenSceneGraph-3.6.0buildbinosgPlugins-3.6.0osgdb_curld.dll
55>------ Compilação iniciada: Projeto: Plugins hdr, Configuração: Debug x64 ------
54>ReaderWriterGZ.cpp
50>osgdb_dxf.vcxproj -> C:UsersAFCM_sourcereposOpenSceneGraph-OpenSceneGraph-3.6.0OpenSceneGraph-OpenSceneGraph-3.6.0buildbinosgPlugins-3.6.0osgdb_dxfd.dll
56>------ Compilação iniciada: Projeto: Plugins ive, Configuração: Debug x64 ------
53>osgdb_glsl.vcxproj -> C:UsersAFCM_sourcereposOpenSceneGraph-OpenSceneGraph-3.6.0OpenSceneGraph-OpenSceneGraph-3.6.0buildbinosgPlugins-3.6.0osgdb_glsld.dll
57>------ Compilação iniciada: Projeto: Plugins jpeg, Configuração: Debug x64 ------
57>Building Custom Rule C:/Users/AFCM_/source/repos/OpenSceneGraph-OpenSceneGraph-3.6.0/OpenSceneGraph-OpenSceneGraph-3.6.0/src/osgPlugins/jpeg/CMakeLists.txt
57>CMake does not need to re-run because C:/Users/AFCM_/source/repos/OpenSceneGraph-OpenSceneGraph-3.6.0/OpenSceneGraph-OpenSceneGraph-3.6.0/build/src/osgPlugins/jpeg/CMakeFiles/generate.stamp is up-to-date.
57>EXIF_Orientation.cpp
56>AlphaFunc.cpp
55>osgdb_hdr.vcxproj -> C:UsersAFCM_sourcereposOpenSceneGraph-OpenSceneGraph-3.6.0OpenSceneGraph-OpenSceneGraph-3.6.0buildbinosgPlugins-3.6.0osgdb_hdrd.dll
58>------ Compilação iniciada: Projeto: Plugins ktx, Configuração: Debug x64 ------
57>ReaderWriterJPEG.cpp
49>application_present3D.vcxproj -> C:UsersAFCM_sourcereposOpenSceneGraph-OpenSceneGraph-3.6.0OpenSceneGraph-OpenSceneGraph-3.6.0buildbinpresent3Dd.exe
52>osgdb_gles.vcxproj -> C:UsersAFCM_sourcereposOpenSceneGraph-OpenSceneGraph-3.6.0OpenSceneGraph-OpenSceneGraph-3.6.0buildbinosgPlugins-3.6.0osgdb_glesd.dll
59>------ Compilação iniciada: Projeto: Plugins logo, Configuração: Debug x64 ------
58>osgdb_ktx.vcxproj -> C:UsersAFCM_sourcereposOpenSceneGraph-OpenSceneGraph-3.6.0OpenSceneGraph-OpenSceneGraph-3.6.0buildbinosgPlugins-3.6.0osgdb_ktxd.dll
60>------ Compilação iniciada: Projeto: Plugins lua, Configuração: Debug x64 ------
17>Gerando Código...
59>osgdb_logo.vcxproj -> C:UsersAFCM_sourcereposOpenSceneGraph-OpenSceneGraph-3.6.0OpenSceneGraph-OpenSceneGraph-3.6.0buildbinosgPlugins-3.6.0osgdb_logod.dll
61>------ Compilação iniciada: Projeto: Plugins lwo, Configuração: Debug x64 ------
62>------ Compilação iniciada: Projeto: Plugins lws, Configuração: Debug x64 ------
60>osgdb_lua.vcxproj -> C:UsersAFCM_sourcereposOpenSceneGraph-OpenSceneGraph-3.6.0OpenSceneGraph-OpenSceneGraph-3.6.0buildbinosgPlugins-3.6.0osgdb_luad.dll
63>------ Compilação iniciada: Projeto: Plugins md2, Configuração: Debug x64 ------
62>osgdb_lws.vcxproj -> C:UsersAFCM_sourcereposOpenSceneGraph-OpenSceneGraph-3.6.0OpenSceneGraph-OpenSceneGraph-3.6.0buildbinosgPlugins-3.6.0osgdb_lwsd.dll
64>------ Compilação iniciada: Projeto: Plugins mdl, Configuração: Debug x64 ------
61>osgdb_lwo.vcxproj -> C:UsersAFCM_sourcereposOpenSceneGraph-OpenSceneGraph-3.6.0OpenSceneGraph-OpenSceneGraph-3.6.0buildbinosgPlugins-3.6.0osgdb_lwod.dll
65>------ Compilação iniciada: Projeto: Plugins normals, Configuração: Debug x64 ------
66>------ Compilação iniciada: Projeto: Plugins nvtt, Configuração: Debug x64 ------
66>Building Custom Rule C:/Users/AFCM_/source/repos/OpenSceneGraph-OpenSceneGraph-3.6.0/OpenSceneGraph-OpenSceneGraph-3.6.0/src/osgPlugins/nvtt/CMakeLists.txt
66>CMake does not need to re-run because C:/Users/AFCM_/source/repos/OpenSceneGraph-OpenSceneGraph-3.6.0/OpenSceneGraph-OpenSceneGraph-3.6.0/build/src/osgPlugins/nvtt/CMakeFiles/generate.stamp is up-to-date.
66>NVTTImageProcessor.cpp
64>osgdb_mdl.vcxproj -> C:UsersAFCM_sourcereposOpenSceneGraph-OpenSceneGraph-3.6.0OpenSceneGraph-OpenSceneGraph-3.6.0buildbinosgPlugins-3.6.0osgdb_mdld.dll
67>------ Compilação iniciada: Projeto: Plugins obj, Configuração: Debug x64 ------
51>DataSetLayer.cpp
65>osgdb_normals.vcxproj -> C:UsersAFCM_sourcereposOpenSceneGraph-OpenSceneGraph-3.6.0OpenSceneGraph-OpenSceneGraph-3.6.0buildbinosgPlugins-3.6.0osgdb_normalsd.dll
68>------ Compilação iniciada: Projeto: Plugins ogr, Configuração: Debug x64 ------
67>osgdb_obj.vcxproj -> C:UsersAFCM_sourcereposOpenSceneGraph-OpenSceneGraph-3.6.0OpenSceneGraph-OpenSceneGraph-3.6.0buildbinosgPlugins-3.6.0osgdb_objd.dll
69>------ Compilação iniciada: Projeto: Plugins openflight, Configuração: Debug x64 ------
54>osgdb_gz.vcxproj -> C:UsersAFCM_sourcereposOpenSceneGraph-OpenSceneGraph-3.6.0OpenSceneGraph-OpenSceneGraph-3.6.0buildbinosgPlugins-3.6.0osgdb_gzd.dll
70>------ Compilação iniciada: Projeto: Plugins osc, Configuração: Debug x64 ------
56>AnimationPathCallback.cpp
57>Gerando Código...
57>jpeg.lib(jerror.obj) : MSIL .netmodule ou módulo compilado com /GL encontrado; reiniciando link com /LTCG; adicione /LTCG ao link da linha de comando para melhorar performance do vinculador
57>LINK : warning LNK4075: ignorando '/INCREMENTAL' devido a especificaþÒo '/LTCG'
57>LINK : warning LNK4098: defaultlib 'MSVCRT' conflita com uso de outras bibliotecas; use /NODEFAULTLIB:library
57>Gerando c¾digo
71>------ Compilação iniciada: Projeto: Plugins osg, Configuração: Debug x64 ------
57>Finalizada a geraþÒo de c¾digo
57>jpeg.lib(jerror.obj) : warning LNK4099: PDB 'jpeg.pdb' nÒo foi encontrado 'jpeg.lib(jerror.obj)' ou no 'C:UsersAFCM_sourcereposOpenSceneGraph-OpenSceneGraph-3.6.0OpenSceneGraph-OpenSceneGraph-3.6.0buildbinosgPlugins-3.6.0jpeg.pdb'; vinculando objeto quando quando sem nenhuma informaþÒo de depuraþÒo
69>osgdb_openflight.vcxproj -> C:UsersAFCM_sourcereposOpenSceneGraph-OpenSceneGraph-3.6.0OpenSceneGraph-OpenSceneGraph-3.6.0buildbinosgPlugins-3.6.0osgdb_openflightd.dll
72>------ Compilação iniciada: Projeto: Plugins osga, Configuração: Debug x64 ------
57>jpeg.lib(jcapimin.obj) : warning LNK4099: PDB 'jpeg.pdb' nÒo foi encontrado 'jpeg.lib(jcapimin.obj)' ou no 'C:UsersAFCM_sourcereposOpenSceneGraph-OpenSceneGraph-3.6.0OpenSceneGraph-OpenSceneGraph-3.6.0buildbinosgPlugins-3.6.0jpeg.pdb'; vinculando objeto quando quando sem nenhuma informaþÒo de depuraþÒo
57>jpeg.lib(jdapimin.obj) : warning LNK4099: PDB 'jpeg.pdb' nÒo foi encontrado 'jpeg.lib(jdapimin.obj)' ou no 'C:UsersAFCM_sourcereposOpenSceneGraph-OpenSceneGraph-3.6.0OpenSceneGraph-OpenSceneGraph-3.6.0buildbinosgPlugins-3.6.0jpeg.pdb'; vinculando objeto quando quando sem nenhuma informaþÒo de depuraþÒo
57>jpeg.lib(jcparam.obj) : warning LNK4099: PDB 'jpeg.pdb' nÒo foi encontrado 'jpeg.lib(jcparam.obj)' ou no 'C:UsersAFCM_sourcereposOpenSceneGraph-OpenSceneGraph-3.6.0OpenSceneGraph-OpenSceneGraph-3.6.0buildbinosgPlugins-3.6.0jpeg.pdb'; vinculando objeto quando quando sem nenhuma informaþÒo de depuraþÒo
57>jpeg.lib(jcapistd.obj) : warning LNK4099: PDB 'jpeg.pdb' nÒo foi encontrado 'jpeg.lib(jcapistd.obj)' ou no 'C:UsersAFCM_sourcereposOpenSceneGraph-OpenSceneGraph-3.6.0OpenSceneGraph-OpenSceneGraph-3.6.0buildbinosgPlugins-3.6.0jpeg.pdb'; vinculando objeto quando quando sem nenhuma informaþÒo de depuraþÒo
57>jpeg.lib(jdapistd.obj) : warning LNK4099: PDB 'jpeg.pdb' nÒo foi encontrado 'jpeg.lib(jdapistd.obj)' ou no 'C:UsersAFCM_sourcereposOpenSceneGraph-OpenSceneGraph-3.6.0OpenSceneGraph-OpenSceneGraph-3.6.0buildbinosgPlugins-3.6.0jpeg.pdb'; vinculando objeto quando quando sem nenhuma informaþÒo de depuraþÒo
57>jpeg.lib(jdmarker.obj) : warning LNK4099: PDB 'jpeg.pdb' nÒo foi encontrado 'jpeg.lib(jdmarker.obj)' ou no 'C:UsersAFCM_sourcereposOpenSceneGraph-OpenSceneGraph-3.6.0OpenSceneGraph-OpenSceneGraph-3.6.0buildbinosgPlugins-3.6.0jpeg.pdb'; vinculando objeto quando quando sem nenhuma informaþÒo de depuraþÒo
57>jpeg.lib(jcomapi.obj) : warning LNK4099: PDB 'jpeg.pdb' nÒo foi encontrado 'jpeg.lib(jcomapi.obj)' ou no 'C:UsersAFCM_sourcereposOpenSceneGraph-OpenSceneGraph-3.6.0OpenSceneGraph-OpenSceneGraph-3.6.0buildbinosgPlugins-3.6.0jpeg.pdb'; vinculando objeto quando quando sem nenhuma informaþÒo de depuraþÒo
57>jpeg.lib(jutils.obj) : warning LNK4099: PDB 'jpeg.pdb' nÒo foi encontrado 'jpeg.lib(jutils.obj)' ou no 'C:UsersAFCM_sourcereposOpenSceneGraph-OpenSceneGraph-3.6.0OpenSceneGraph-OpenSceneGraph-3.6.0buildbinosgPlugins-3.6.0jpeg.pdb'; vinculando objeto quando quando sem nenhuma informaþÒo de depuraþÒo
57>jpeg.lib(jmemmgr.obj) : warning LNK4099: PDB 'jpeg.pdb' nÒo foi encontrado 'jpeg.lib(jmemmgr.obj)' ou no 'C:UsersAFCM_sourcereposOpenSceneGraph-OpenSceneGraph-3.6.0OpenSceneGraph-OpenSceneGraph-3.6.0buildbinosgPlugins-3.6.0jpeg.pdb'; vinculando objeto quando quando sem nenhuma informaþÒo de depuraþÒo
57>jpeg.lib(jcmarker.obj) : warning LNK4099: PDB 'jpeg.pdb' nÒo foi encontrado 'jpeg.lib(jcmarker.obj)' ou no 'C:UsersAFCM_sourcereposOpenSceneGraph-OpenSceneGraph-3.6.0OpenSceneGraph-OpenSceneGraph-3.6.0buildbinosgPlugins-3.6.0jpeg.pdb'; vinculando objeto quando quando sem nenhuma informaþÒo de depuraþÒo
57>jpeg.lib(jdinput.obj) : warning LNK4099: PDB 'jpeg.pdb' nÒo foi encontrado 'jpeg.lib(jdinput.obj)' ou no 'C:UsersAFCM_sourcereposOpenSceneGraph-OpenSceneGraph-3.6.0OpenSceneGraph-OpenSceneGraph-3.6.0buildbinosgPlugins-3.6.0jpeg.pdb'; vinculando objeto quando quando sem nenhuma informaþÒo de depuraþÒo
57>jpeg.lib(jcinit.obj) : warning LNK4099: PDB 'jpeg.pdb' nÒo foi encontrado 'jpeg.lib(jcinit.obj)' ou no 'C:UsersAFCM_sourcereposOpenSceneGraph-OpenSceneGraph-3.6.0OpenSceneGraph-OpenSceneGraph-3.6.0buildbinosgPlugins-3.6.0jpeg.pdb'; vinculando objeto quando quando sem nenhuma informaþÒo de depuraþÒo
57>jpeg.lib(jdmaster.obj) : warning LNK4099: PDB 'jpeg.pdb' nÒo foi encontrado 'jpeg.lib(jdmaster.obj)' ou no 'C:UsersAFCM_sourcereposOpenSceneGraph-OpenSceneGraph-3.6.0OpenSceneGraph-OpenSceneGraph-3.6.0buildbinosgPlugins-3.6.0jpeg.pdb'; vinculando objeto quando quando sem nenhuma informaþÒo de depuraþÒo
57>jpeg.lib(jmemnobs.obj) : warning LNK4099: PDB 'jpeg.pdb' nÒo foi encontrado 'jpeg.lib(jmemnobs.obj)' ou no 'C:UsersAFCM_sourcereposOpenSceneGraph-OpenSceneGraph-3.6.0OpenSceneGraph-OpenSceneGraph-3.6.0buildbinosgPlugins-3.6.0jpeg.pdb'; vinculando objeto quando quando sem nenhuma informaþÒo de depuraþÒo
57>jpeg.lib(jcarith.obj) : warning LNK4099: PDB 'jpeg.pdb' nÒo foi encontrado 'jpeg.lib(jcarith.obj)' ou no 'C:UsersAFCM_sourcereposOpenSceneGraph-OpenSceneGraph-3.6.0OpenSceneGraph-OpenSceneGraph-3.6.0buildbinosgPlugins-3.6.0jpeg.pdb'; vinculando objeto quando quando sem nenhuma informaþÒo de depuraþÒo
57>jpeg.lib(jcprepct.obj) : warning LNK4099: PDB 'jpeg.pdb' nÒo foi encontrado 'jpeg.lib(jcprepct.obj)' ou no 'C:UsersAFCM_sourcereposOpenSceneGraph-OpenSceneGraph-3.6.0OpenSceneGraph-OpenSceneGraph-3.6.0buildbinosgPlugins-3.6.0jpeg.pdb'; vinculando objeto quando quando sem nenhuma informaþÒo de depuraþÒo
57>jpeg.lib(jcsample.obj) : warning LNK4099: PDB 'jpeg.pdb' nÒo foi encontrado 'jpeg.lib(jcsample.obj)' ou no 'C:UsersAFCM_sourcereposOpenSceneGraph-OpenSceneGraph-3.6.0OpenSceneGraph-OpenSceneGraph-3.6.0buildbinosgPlugins-3.6.0jpeg.pdb'; vinculando objeto quando quando sem nenhuma informaþÒo de depuraþÒo
57>jpeg.lib(jcmainct.obj) : warning LNK4099: PDB 'jpeg.pdb' nÒo foi encontrado 'jpeg.lib(jcmainct.obj)' ou no 'C:UsersAFCM_sourcereposOpenSceneGraph-OpenSceneGraph-3.6.0OpenSceneGraph-OpenSceneGraph-3.6.0buildbinosgPlugins-3.6.0jpeg.pdb'; vinculando objeto quando quando sem nenhuma informaþÒo de depuraþÒo
57>jpeg.lib(jcmaster.obj) : warning LNK4099: PDB 'jpeg.pdb' nÒo foi encontrado 'jpeg.lib(jcmaster.obj)' ou no 'C:UsersAFCM_sourcereposOpenSceneGraph-OpenSceneGraph-3.6.0OpenSceneGraph-OpenSceneGraph-3.6.0buildbinosgPlugins-3.6.0jpeg.pdb'; vinculando objeto quando quando sem nenhuma informaþÒo de depuraþÒo
57>jpeg.lib(jccoefct.obj) : warning LNK4099: PDB 'jpeg.pdb' nÒo foi encontrado 'jpeg.lib(jccoefct.obj)' ou no 'C:UsersAFCM_sourcereposOpenSceneGraph-OpenSceneGraph-3.6.0OpenSceneGraph-OpenSceneGraph-3.6.0buildbinosgPlugins-3.6.0jpeg.pdb'; vinculando objeto quando quando sem nenhuma informaþÒo de depuraþÒo
57>jpeg.lib(jccolor.obj) : warning LNK4099: PDB 'jpeg.pdb' nÒo foi encontrado 'jpeg.lib(jccolor.obj)' ou no 'C:UsersAFCM_sourcereposOpenSceneGraph-OpenSceneGraph-3.6.0OpenSceneGraph-OpenSceneGraph-3.6.0buildbinosgPlugins-3.6.0jpeg.pdb'; vinculando objeto quando quando sem nenhuma informaþÒo de depuraþÒo
57>jpeg.lib(jchuff.obj) : warning LNK4099: PDB 'jpeg.pdb' nÒo foi encontrado 'jpeg.lib(jchuff.obj)' ou no 'C:UsersAFCM_sourcereposOpenSceneGraph-OpenSceneGraph-3.6.0OpenSceneGraph-OpenSceneGraph-3.6.0buildbinosgPlugins-3.6.0jpeg.pdb'; vinculando objeto quando quando sem nenhuma informaþÒo de depuraþÒo
57>jpeg.lib(jcdctmgr.obj) : warning LNK4099: PDB 'jpeg.pdb' nÒo foi encontrado 'jpeg.lib(jcdctmgr.obj)' ou no 'C:UsersAFCM_sourcereposOpenSceneGraph-OpenSceneGraph-3.6.0OpenSceneGraph-OpenSceneGraph-3.6.0buildbinosgPlugins-3.6.0jpeg.pdb'; vinculando objeto quando quando sem nenhuma informaþÒo de depuraþÒo
57>jpeg.lib(jquant1.obj) : warning LNK4099: PDB 'jpeg.pdb' nÒo foi encontrado 'jpeg.lib(jquant1.obj)' ou no 'C:UsersAFCM_sourcereposOpenSceneGraph-OpenSceneGraph-3.6.0OpenSceneGraph-OpenSceneGraph-3.6.0buildbinosgPlugins-3.6.0jpeg.pdb'; vinculando objeto quando quando sem nenhuma informaþÒo de depuraþÒo
57>jpeg.lib(jdmerge.obj) : warning LNK4099: PDB 'jpeg.pdb' nÒo foi encontrado 'jpeg.lib(jdmerge.obj)' ou no 'C:UsersAFCM_sourcereposOpenSceneGraph-OpenSceneGraph-3.6.0OpenSceneGraph-OpenSceneGraph-3.6.0buildbinosgPlugins-3.6.0jpeg.pdb'; vinculando objeto quando quando sem nenhuma informaþÒo de depuraþÒo
57>jpeg.lib(jdsample.obj) : warning LNK4099: PDB 'jpeg.pdb' nÒo foi encontrado 'jpeg.lib(jdsample.obj)' ou no 'C:UsersAFCM_sourcereposOpenSceneGraph-OpenSceneGraph-3.6.0OpenSceneGraph-OpenSceneGraph-3.6.0buildbinosgPlugins-3.6.0jpeg.pdb'; vinculando objeto quando quando sem nenhuma informaþÒo de depuraþÒo
57>jpeg.lib(jdhuff.obj) : warning LNK4099: PDB 'jpeg.pdb' nÒo foi encontrado 'jpeg.lib(jdhuff.obj)' ou no 'C:UsersAFCM_sourcereposOpenSceneGraph-OpenSceneGraph-3.6.0OpenSceneGraph-OpenSceneGraph-3.6.0buildbinosgPlugins-3.6.0jpeg.pdb'; vinculando objeto quando quando sem nenhuma informaþÒo de depuraþÒo
57>jpeg.lib(jquant2.obj) : warning LNK4099: PDB 'jpeg.pdb' nÒo foi encontrado 'jpeg.lib(jquant2.obj)' ou no 'C:UsersAFCM_sourcereposOpenSceneGraph-OpenSceneGraph-3.6.0OpenSceneGraph-OpenSceneGraph-3.6.0buildbinosgPlugins-3.6.0jpeg.pdb'; vinculando objeto quando quando sem nenhuma informaþÒo de depuraþÒo
57>jpeg.lib(jdarith.obj) : warning LNK4099: PDB 'jpeg.pdb' nÒo foi encontrado 'jpeg.lib(jdarith.obj)' ou no 'C:UsersAFCM_sourcereposOpenSceneGraph-OpenSceneGraph-3.6.0OpenSceneGraph-OpenSceneGraph-3.6.0buildbinosgPlugins-3.6.0jpeg.pdb'; vinculando objeto quando quando sem nenhuma informaþÒo de depuraþÒo
57>jpeg.lib(jdcoefct.obj) : warning LNK4099: PDB 'jpeg.pdb' nÒo foi encontrado 'jpeg.lib(jdcoefct.obj)' ou no 'C:UsersAFCM_sourcereposOpenSceneGraph-OpenSceneGraph-3.6.0OpenSceneGraph-OpenSceneGraph-3.6.0buildbinosgPlugins-3.6.0jpeg.pdb'; vinculando objeto quando quando sem nenhuma informaþÒo de depuraþÒo
57>jpeg.lib(jdcolor.obj) : warning LNK4099: PDB 'jpeg.pdb' nÒo foi encontrado 'jpeg.lib(jdcolor.obj)' ou no 'C:UsersAFCM_sourcereposOpenSceneGraph-OpenSceneGraph-3.6.0OpenSceneGraph-OpenSceneGraph-3.6.0buildbinosgPlugins-3.6.0jpeg.pdb'; vinculando objeto quando quando sem nenhuma informaþÒo de depuraþÒo
57>jpeg.lib(jdmainct.obj) : warning LNK4099: PDB 'jpeg.pdb' nÒo foi encontrado 'jpeg.lib(jdmainct.obj)' ou no 'C:UsersAFCM_sourcereposOpenSceneGraph-OpenSceneGraph-3.6.0OpenSceneGraph-OpenSceneGraph-3.6.0buildbinosgPlugins-3.6.0jpeg.pdb'; vinculando objeto quando quando sem nenhuma informaþÒo de depuraþÒo
57>jpeg.lib(jddctmgr.obj) : warning LNK4099: PDB 'jpeg.pdb' nÒo foi encontrado 'jpeg.lib(jddctmgr.obj)' ou no 'C:UsersAFCM_sourcereposOpenSceneGraph-OpenSceneGraph-3.6.0OpenSceneGraph-OpenSceneGraph-3.6.0buildbinosgPlugins-3.6.0jpeg.pdb'; vinculando objeto quando quando sem nenhuma informaþÒo de depuraþÒo
57>jpeg.lib(jdpostct.obj) : warning LNK4099: PDB 'jpeg.pdb' nÒo foi encontrado 'jpeg.lib(jdpostct.obj)' ou no 'C:UsersAFCM_sourcereposOpenSceneGraph-OpenSceneGraph-3.6.0OpenSceneGraph-OpenSceneGraph-3.6.0buildbinosgPlugins-3.6.0jpeg.pdb'; vinculando objeto quando quando sem nenhuma informaþÒo de depuraþÒo
57>jpeg.lib(jaricom.obj) : warning LNK4099: PDB 'jpeg.pdb' nÒo foi encontrado 'jpeg.lib(jaricom.obj)' ou no 'C:UsersAFCM_sourcereposOpenSceneGraph-OpenSceneGraph-3.6.0OpenSceneGraph-OpenSceneGraph-3.6.0buildbinosgPlugins-3.6.0jpeg.pdb'; vinculando objeto quando quando sem nenhuma informaþÒo de depuraþÒo
57>jpeg.lib(jfdctint.obj) : warning LNK4099: PDB 'jpeg.pdb' nÒo foi encontrado 'jpeg.lib(jfdctint.obj)' ou no 'C:UsersAFCM_sourcereposOpenSceneGraph-OpenSceneGraph-3.6.0OpenSceneGraph-OpenSceneGraph-3.6.0buildbinosgPlugins-3.6.0jpeg.pdb'; vinculando objeto quando quando sem nenhuma informaþÒo de depuraþÒo
57>jpeg.lib(jfdctfst.obj) : warning LNK4099: PDB 'jpeg.pdb' nÒo foi encontrado 'jpeg.lib(jfdctfst.obj)' ou no 'C:UsersAFCM_sourcereposOpenSceneGraph-OpenSceneGraph-3.6.0OpenSceneGraph-OpenSceneGraph-3.6.0buildbinosgPlugins-3.6.0jpeg.pdb'; vinculando objeto quando quando sem nenhuma informaþÒo de depuraþÒo
57>jpeg.lib(jfdctflt.obj) : warning LNK4099: PDB 'jpeg.pdb' nÒo foi encontrado 'jpeg.lib(jfdctflt.obj)' ou no 'C:UsersAFCM_sourcereposOpenSceneGraph-OpenSceneGraph-3.6.0OpenSceneGraph-OpenSceneGraph-3.6.0buildbinosgPlugins-3.6.0jpeg.pdb'; vinculando objeto quando quando sem nenhuma informaþÒo de depuraþÒo
57>jpeg.lib(jidctint.obj) : warning LNK4099: PDB 'jpeg.pdb' nÒo foi encontrado 'jpeg.lib(jidctint.obj)' ou no 'C:UsersAFCM_sourcereposOpenSceneGraph-OpenSceneGraph-3.6.0OpenSceneGraph-OpenSceneGraph-3.6.0buildbinosgPlugins-3.6.0jpeg.pdb'; vinculando objeto quando quando sem nenhuma informaþÒo de depuraþÒo
57>jpeg.lib(jidctfst.obj) : warning LNK4099: PDB 'jpeg.pdb' nÒo foi encontrado 'jpeg.lib(jidctfst.obj)' ou no 'C:UsersAFCM_sourcereposOpenSceneGraph-OpenSceneGraph-3.6.0OpenSceneGraph-OpenSceneGraph-3.6.0buildbinosgPlugins-3.6.0jpeg.pdb'; vinculando objeto quando quando sem nenhuma informaþÒo de depuraþÒo
57>jpeg.lib(jidctflt.obj) : warning LNK4099: PDB 'jpeg.pdb' nÒo foi encontrado 'jpeg.lib(jidctflt.obj)' ou no 'C:UsersAFCM_sourcereposOpenSceneGraph-OpenSceneGraph-3.6.0OpenSceneGraph-OpenSceneGraph-3.6.0buildbinosgPlugins-3.6.0jpeg.pdb'; vinculando objeto quando quando sem nenhuma informaþÒo de depuraþÒo
71>osgdb_osg.vcxproj -> C:UsersAFCM_sourcereposOpenSceneGraph-OpenSceneGraph-3.6.0OpenSceneGraph-OpenSceneGraph-3.6.0buildbinosgPlugins-3.6.0osgdb_osgd.dll
73>------ Compilação iniciada: Projeto: Plugins osgjs, Configuração: Debug x64 ------
57>osgdb_jpeg.vcxproj -> C:UsersAFCM_sourcereposOpenSceneGraph-OpenSceneGraph-3.6.0OpenSceneGraph-OpenSceneGraph-3.6.0buildbinosgPlugins-3.6.0osgdb_jpegd.dll
57>Projeto de compilação pronto "osgdb_jpeg.vcxproj".
74>------ Compilação iniciada: Projeto: Plugins osgshadow, Configuração: Debug x64 ------
51>Gerando Código...
72>osgdb_osga.vcxproj -> C:UsersAFCM_sourcereposOpenSceneGraph-OpenSceneGraph-3.6.0OpenSceneGraph-OpenSceneGraph-3.6.0buildbinosgPlugins-3.6.0osgdb_osgad.dll
75>------ Compilação iniciada: Projeto: Plugins osgterrain, Configuração: Debug x64 ------
74>osgdb_osgshadow.vcxproj -> C:UsersAFCM_sourcereposOpenSceneGraph-OpenSceneGraph-3.6.0OpenSceneGraph-OpenSceneGraph-3.6.0buildbinosgPlugins-3.6.0osgdb_osgshadowd.dll
76>------ Compilação iniciada: Projeto: Plugins osgtgz, Configuração: Debug x64 ------
73>osgdb_osgjs.vcxproj -> C:UsersAFCM_sourcereposOpenSceneGraph-OpenSceneGraph-3.6.0OpenSceneGraph-OpenSceneGraph-3.6.0buildbinosgPlugins-3.6.0osgdb_osgjsd.dll
77>------ Compilação iniciada: Projeto: Plugins osgviewer, Configuração: Debug x64 ------
75>osgdb_osgterrain.vcxproj -> C:UsersAFCM_sourcereposOpenSceneGraph-OpenSceneGraph-3.6.0OpenSceneGraph-OpenSceneGraph-3.6.0buildbinosgPlugins-3.6.0osgdb_osgterraind.dll
78>------ Compilação iniciada: Projeto: Plugins p3d, Configuração: Debug x64 ------
66>osgdb_nvtt.vcxproj -> C:UsersAFCM_sourcereposOpenSceneGraph-OpenSceneGraph-3.6.0OpenSceneGraph-OpenSceneGraph-3.6.0buildbinosgPlugins-3.6.0osgdb_nvttd.dll
79>------ Compilação iniciada: Projeto: Plugins pic, Configuração: Debug x64 ------
76>osgdb_osgtgz.vcxproj -> C:UsersAFCM_sourcereposOpenSceneGraph-OpenSceneGraph-3.6.0OpenSceneGraph-OpenSceneGraph-3.6.0buildbinosgPlugins-3.6.0osgdb_osgtgzd.dll
80>------ Compilação iniciada: Projeto: Plugins ply, Configuração: Debug x64 ------
77>osgdb_osgviewer.vcxproj -> C:UsersAFCM_sourcereposOpenSceneGraph-OpenSceneGraph-3.6.0OpenSceneGraph-OpenSceneGraph-3.6.0buildbinosgPlugins-3.6.0osgdb_osgviewerd.dll
81>------ Compilação iniciada: Projeto: Plugins png, Configuração: Debug x64 ------
81>Building Custom Rule C:/Users/AFCM_/source/repos/OpenSceneGraph-OpenSceneGraph-3.6.0/OpenSceneGraph-OpenSceneGraph-3.6.0/src/osgPlugins/png/CMakeLists.txt
81>CMake does not need to re-run because C:/Users/AFCM_/source/repos/OpenSceneGraph-OpenSceneGraph-3.6.0/OpenSceneGraph-OpenSceneGraph-3.6.0/build/src/osgPlugins/png/CMakeFiles/generate.stamp is up-to-date.
51>   Criando biblioteca C:/Users/AFCM_/source/repos/OpenSceneGraph-OpenSceneGraph-3.6.0/OpenSceneGraph-OpenSceneGraph-3.6.0/build/lib/osgPlugins-3.6.0/osgdb_gdald.lib e objeto C:/Users/AFCM_/source/repos/OpenSceneGraph-OpenSceneGraph-3.6.0/OpenSceneGraph-OpenSceneGraph-3.6.0/build/lib/osgPlugins-3.6.0/osgdb_gdald.exp
81>ReaderWriterPNG.cpp
56>AnimationPath.cpp
79>osgdb_pic.vcxproj -> C:UsersAFCM_sourcereposOpenSceneGraph-OpenSceneGraph-3.6.0OpenSceneGraph-OpenSceneGraph-3.6.0buildbinosgPlugins-3.6.0osgdb_picd.dll
78>osgdb_p3d.vcxproj -> C:UsersAFCM_sourcereposOpenSceneGraph-OpenSceneGraph-3.6.0OpenSceneGraph-OpenSceneGraph-3.6.0buildbinosgPlugins-3.6.0osgdb_p3dd.dll
82>------ Compilação iniciada: Projeto: Plugins pnm, Configuração: Debug x64 ------
83>------ Compilação iniciada: Projeto: Plugins pov, Configuração: Debug x64 ------
80>osgdb_ply.vcxproj -> C:UsersAFCM_sourcereposOpenSceneGraph-OpenSceneGraph-3.6.0OpenSceneGraph-OpenSceneGraph-3.6.0buildbinosgPlugins-3.6.0osgdb_plyd.dll
84>------ Compilação iniciada: Projeto: Plugins pvr, Configuração: Debug x64 ------
51>osgdb_gdal.vcxproj -> C:UsersAFCM_sourcereposOpenSceneGraph-OpenSceneGraph-3.6.0OpenSceneGraph-OpenSceneGraph-3.6.0buildbinosgPlugins-3.6.0osgdb_gdald.dll
85>------ Compilação iniciada: Projeto: Plugins revisions, Configuração: Debug x64 ------
82>osgdb_pnm.vcxproj -> C:UsersAFCM_sourcereposOpenSceneGraph-OpenSceneGraph-3.6.0OpenSceneGraph-OpenSceneGraph-3.6.0buildbinosgPlugins-3.6.0osgdb_pnmd.dll
84>osgdb_pvr.vcxproj -> C:UsersAFCM_sourcereposOpenSceneGraph-OpenSceneGraph-3.6.0OpenSceneGraph-OpenSceneGraph-3.6.0buildbinosgPlugins-3.6.0osgdb_pvrd.dll
86>------ Compilação iniciada: Projeto: Plugins rgb, Configuração: Debug x64 ------
87>------ Compilação iniciada: Projeto: Plugins rot, Configuração: Debug x64 ------
85>osgdb_revisions.vcxproj -> C:UsersAFCM_sourcereposOpenSceneGraph-OpenSceneGraph-3.6.0OpenSceneGraph-OpenSceneGraph-3.6.0buildbinosgPlugins-3.6.0osgdb_revisionsd.dll
88>------ Compilação iniciada: Projeto: Plugins scale, Configuração: Debug x64 ------
89>------ Compilação iniciada: Projeto: Plugins osg serializer osg, Configuração: Debug x64 ------
90>------ Compilação iniciada: Projeto: Plugins osg serializer osganimation, Configuração: Debug x64 ------
90>C:Program Files (x86)Microsoft Visual Studio2017CommunityCommon7IDEVCVCTargetsMicrosoft.CppBuild.targets(321,5): error MSB3491: Não foi possível gravar linhas no arquivo "osgdb_serializers_osganimation.dirDebugPlugins .BC34A2F6.tlogPlugins osg serializer osganimation.lastbuildstate". O caminho e nome de ficheiro especificados, ou ambos, são demasiado grandes. O nome de ficheiro totalmente qualificado tem de ser inferior a 260 caracteres e o nome do directório tem de ser inferior a 248 caracteres.
90>Projeto de compilação pronto "osgdb_serializers_osganimation.vcxproj" -- FALHA.
91>------ Compilação iniciada: Projeto: Plugins osg serializer osgfx, Configuração: Debug x64 ------
86>osgdb_rgb.vcxproj -> C:UsersAFCM_sourcereposOpenSceneGraph-OpenSceneGraph-3.6.0OpenSceneGraph-OpenSceneGraph-3.6.0buildbinosgPlugins-3.6.0osgdb_rgbd.dll
92>------ Compilação iniciada: Projeto: Plugins osg serializer osgga, Configuração: Debug x64 ------
87>osgdb_rot.vcxproj -> C:UsersAFCM_sourcereposOpenSceneGraph-OpenSceneGraph-3.6.0OpenSceneGraph-OpenSceneGraph-3.6.0buildbinosgPlugins-3.6.0osgdb_rotd.dll
93>------ Compilação iniciada: Projeto: Plugins osg serializer osgmanipulator, Configuração: Debug x64 ------
93>C:Program Files (x86)Microsoft Visual Studio2017CommunityCommon7IDEVCVCTargetsMicrosoft.CppBuild.targets(321,5): error MSB3491: Não foi possível gravar linhas no arquivo "osgdb_serializers_osgmanipulator.dirDebugPlugins .D2061F02.tlogPlugins osg serializer osgmanipulator.lastbuildstate". O caminho e nome de ficheiro especificados, ou ambos, são demasiado grandes. O nome de ficheiro totalmente qualificado tem de ser inferior a 260 caracteres e o nome do directório tem de ser inferior a 248 caracteres.
93>Projeto de compilação pronto "osgdb_serializers_osgmanipulator.vcxproj" -- FALHA.
88>osgdb_scale.vcxproj -> C:UsersAFCM_sourcereposOpenSceneGraph-OpenSceneGraph-3.6.0OpenSceneGraph-OpenSceneGraph-3.6.0buildbinosgPlugins-3.6.0osgdb_scaled.dll
94>------ Compilação iniciada: Projeto: Plugins osg serializer osgparticle, Configuração: Debug x64 ------
95>------ Compilação iniciada: Projeto: Plugins osg serializer osgshadow, Configuração: Debug x64 ------
91>osgdb_serializers_osgfx.vcxproj -> C:UsersAFCM_sourcereposOpenSceneGraph-OpenSceneGraph-3.6.0OpenSceneGraph-OpenSceneGraph-3.6.0buildbinosgPlugins-3.6.0osgdb_serializers_osgfxd.dll
96>------ Compilação iniciada: Projeto: Plugins osg serializer osgsim, Configuração: Debug x64 ------
92>osgdb_serializers_osgga.vcxproj -> C:UsersAFCM_sourcereposOpenSceneGraph-OpenSceneGraph-3.6.0OpenSceneGraph-OpenSceneGraph-3.6.0buildbinosgPlugins-3.6.0osgdb_serializers_osggad.dll
97>------ Compilação iniciada: Projeto: Plugins osg serializer osgterrain, Configuração: Debug x64 ------
95>osgdb_serializers_osgshadow.vcxproj -> C:UsersAFCM_sourcereposOpenSceneGraph-OpenSceneGraph-3.6.0OpenSceneGraph-OpenSceneGraph-3.6.0buildbinosgPlugins-3.6.0osgdb_serializers_osgshadowd.dll
98>------ Compilação iniciada: Projeto: Plugins osg serializer osgtext, Configuração: Debug x64 ------
96>osgdb_serializers_osgsim.vcxproj -> C:UsersAFCM_sourcereposOpenSceneGraph-OpenSceneGraph-3.6.0OpenSceneGraph-OpenSceneGraph-3.6.0buildbinosgPlugins-3.6.0osgdb_serializers_osgsimd.dll
99>------ Compilação iniciada: Projeto: Plugins osg serializer osgui, Configuração: Debug x64 ------
94>osgdb_serializers_osgparticle.vcxproj -> C:UsersAFCM_sourcereposOpenSceneGraph-OpenSceneGraph-3.6.0OpenSceneGraph-OpenSceneGraph-3.6.0buildbinosgPlugins-3.6.0osgdb_serializers_osgparticled.dll
97>osgdb_serializers_osgterrain.vcxproj -> C:UsersAFCM_sourcereposOpenSceneGraph-OpenSceneGraph-3.6.0OpenSceneGraph-OpenSceneGraph-3.6.0buildbinosgPlugins-3.6.0osgdb_serializers_osgterraind.dll
100>------ Compilação iniciada: Projeto: Plugins osg serializer osgutil, Configuração: Debug x64 ------
101>------ Compilação iniciada: Projeto: Plugins osg serializer osgviewer, Configuração: Debug x64 ------
102>------ Compilação iniciada: Projeto: Plugins osg serializer osgvolume, Configuração: Debug x64 ------
99>osgdb_serializers_osgui.vcxproj -> C:UsersAFCM_sourcereposOpenSceneGraph-OpenSceneGraph-3.6.0OpenSceneGraph-OpenSceneGraph-3.6.0buildbinosgPlugins-3.6.0osgdb_serializers_osguid.dll
103>------ Compilação iniciada: Projeto: Plugins shp, Configuração: Debug x64 ------
100>osgdb_serializers_osgutil.vcxproj -> C:UsersAFCM_sourcereposOpenSceneGraph-OpenSceneGraph-3.6.0OpenSceneGraph-OpenSceneGraph-3.6.0buildbinosgPlugins-3.6.0osgdb_serializers_osgutild.dll
104>------ Compilação iniciada: Projeto: Plugins stl, Configuração: Debug x64 ------
101>osgdb_serializers_osgviewer.vcxproj -> C:UsersAFCM_sourcereposOpenSceneGraph-OpenSceneGraph-3.6.0OpenSceneGraph-OpenSceneGraph-3.6.0buildbinosgPlugins-3.6.0osgdb_serializers_osgviewerd.dll
105>------ Compilação iniciada: Projeto: Plugins tf, Configuração: Debug x64 ------
106>------ Compilação iniciada: Projeto: Plugins tga, Configuração: Debug x64 ------
56>AnisotropicLighting.cpp
102>osgdb_serializers_osgvolume.vcxproj -> C:UsersAFCM_sourcereposOpenSceneGraph-OpenSceneGraph-3.6.0OpenSceneGraph-OpenSceneGraph-3.6.0buildbinosgPlugins-3.6.0osgdb_serializers_osgvolumed.dll
107>------ Compilação iniciada: Projeto: Plugins tgz, Configuração: Debug x64 ------
103>osgdb_shp.vcxproj -> C:UsersAFCM_sourcereposOpenSceneGraph-OpenSceneGraph-3.6.0OpenSceneGraph-OpenSceneGraph-3.6.0buildbinosgPlugins-3.6.0osgdb_shpd.dll
108>------ Compilação iniciada: Projeto: Plugins tiff, Configuração: Debug x64 ------
104>osgdb_stl.vcxproj -> C:UsersAFCM_sourcereposOpenSceneGraph-OpenSceneGraph-3.6.0OpenSceneGraph-OpenSceneGraph-3.6.0buildbinosgPlugins-3.6.0osgdb_stld.dll
81>osgdb_png.vcxproj -> C:UsersAFCM_sourcereposOpenSceneGraph-OpenSceneGraph-3.6.0OpenSceneGraph-OpenSceneGraph-3.6.0buildbinosgPlugins-3.6.0osgdb_pngd.dll
106>osgdb_tga.vcxproj -> C:UsersAFCM_sourcereposOpenSceneGraph-OpenSceneGraph-3.6.0OpenSceneGraph-OpenSceneGraph-3.6.0buildbinosgPlugins-3.6.0osgdb_tgad.dll
105>osgdb_tf.vcxproj -> C:UsersAFCM_sourcereposOpenSceneGraph-OpenSceneGraph-3.6.0OpenSceneGraph-OpenSceneGraph-3.6.0buildbinosgPlugins-3.6.0osgdb_tfd.dll
109>------ Compilação iniciada: Projeto: Plugins trans, Configuração: Debug x64 ------
108>Building Custom Rule C:/Users/AFCM_/source/repos/OpenSceneGraph-OpenSceneGraph-3.6.0/OpenSceneGraph-OpenSceneGraph-3.6.0/src/osgPlugins/tiff/CMakeLists.txt
108>CMake does not need to re-run because C:/Users/AFCM_/source/repos/OpenSceneGraph-OpenSceneGraph-3.6.0/OpenSceneGraph-OpenSceneGraph-3.6.0/build/src/osgPlugins/tiff/CMakeFiles/generate.stamp is up-to-date.
108>ReaderWriterTIFF.cpp
107>osgdb_tgz.vcxproj -> C:UsersAFCM_sourcereposOpenSceneGraph-OpenSceneGraph-3.6.0OpenSceneGraph-OpenSceneGraph-3.6.0buildbinosgPlugins-3.6.0osgdb_tgzd.dll
109>osgdb_trans.vcxproj -> C:UsersAFCM_sourcereposOpenSceneGraph-OpenSceneGraph-3.6.0OpenSceneGraph-OpenSceneGraph-3.6.0buildbinosgPlugins-3.6.0osgdb_transd.dll
56>AutoTransform.cpp
108>osgdb_tiff.vcxproj -> C:UsersAFCM_sourcereposOpenSceneGraph-OpenSceneGraph-3.6.0OpenSceneGraph-OpenSceneGraph-3.6.0buildbinosgPlugins-3.6.0osgdb_tiffd.dll
56>AzimElevationSector.cpp
56>AzimSector.cpp
56>Billboard.cpp
56>BlendColor.cpp
56>BlendEquation.cpp
56>BlendFunc.cpp
56>BlinkSequence.cpp
56>BumpMapping.cpp
56>Camera.cpp
56>CameraView.cpp
56>Cartoon.cpp
56>ClipNode.cpp
56>ClipPlane.cpp
56>ClusterCullingCallback.cpp
56>ColorMask.cpp
56>Gerando Código...
56>Compilando...
56>CompositeLayer.cpp
56>ConeSector.cpp
56>ConvexPlanarOccluder.cpp
56>ConvexPlanarPolygon.cpp
56>CoordinateSystemNode.cpp
56>CullFace.cpp
56>DataInputStream.cpp
56>DataOutputStream.cpp
56>Depth.cpp
56>DirectionalSector.cpp
56>DOFTransform.cpp
56>Drawable.cpp
56>DrawArrayLengths.cpp
56>DrawArrays.cpp
56>DrawElementsUByte.cpp
56>DrawElementsUInt.cpp
56>DrawElementsUShort.cpp
56>Effect.cpp
56>ElevationSector.cpp
56>EllipsoidModel.cpp
56>Gerando Código...
56>Compilando...
56>Exception.cpp
56>FadeText.cpp
56>Fog.cpp
56>FragmentProgram.cpp
56>FrontFace.cpp
56>Geode.cpp
56>Geometry.cpp
56>Group.cpp
56>HeightFieldLayer.cpp
56>Image.cpp
56>ImageLayer.cpp
56>ImageSequence.cpp
56>Impostor.cpp
56>Layer.cpp
56>Light.cpp
56>LightModel.cpp
56>LightPoint.cpp
56>LightPointNode.cpp
56>LightSource.cpp
56>LineStipple.cpp
56>Gerando Código...
56>Compilando...
56>LineWidth.cpp
56>Locator.cpp
56>LOD.cpp
56>Material.cpp
56>MatrixTransform.cpp
56>Multisample.cpp
56>MultiSwitch.cpp
56>MultiTextureControl.cpp
56>Node.cpp
56>Object.cpp
56>OccluderNode.cpp
56>OcclusionQueryNode.cpp
56>PagedLOD.cpp
56>Point.cpp
56>PointSprite.cpp
56>PolygonMode.cpp
56>PolygonOffset.cpp
56>PolygonStipple.cpp
56>PositionAttitudeTransform.cpp
56>PrimitiveSet.cpp
56>Gerando Código...
56>Compilando...
56>Program.cpp
56>ProxyNode.cpp
56>ReaderWriterIVE.cpp
56>Scissor.cpp
56>Scribe.cpp
56>Sequence.cpp
56>ShadeModel.cpp
56>Shader.cpp
56>ShapeAttributeList.cpp
56>Shape.cpp
56>ShapeDrawable.cpp
56>SpecularHighlights.cpp
56>StateSet.cpp
56>Stencil.cpp
56>StencilTwoSided.cpp
56>Switch.cpp
56>SwitchLayer.cpp
56>Terrain.cpp
56>TerrainTile.cpp
56>TexEnvCombine.cpp
56>Gerando Código...
56>Compilando...
56>TexEnv.cpp
56>TexGen.cpp
56>TexGenNode.cpp
56>TexMat.cpp
56>Text3D.cpp
56>Text.cpp
56>Texture1D.cpp
56>Texture2D.cpp
56>Texture2DArray.cpp
56>Texture3D.cpp
56>Texture.cpp
56>TextureCubeMap.cpp
56>TextureRectangle.cpp
56>Transform.cpp
56>Uniform.cpp
56>VertexProgram.cpp
56>Viewport.cpp
56>VisibilityGroup.cpp
56>VolumeCompositeLayer.cpp
56>VolumeCompositeProperty.cpp
56>Gerando Código...
56>Compilando...
56>VolumeSwitchProperty.cpp
56>VolumeScalarProperty.cpp
56>VolumeTransferFunctionProperty.cpp
56>VolumePropertyAdjustmentCallback.cpp
56>Volume.cpp
56>VolumeImageLayer.cpp
56>VolumeLayer.cpp
56>VolumeLocator.cpp
56>VolumeTile.cpp
56>Gerando Código...
17>osgdb_zip.vcxproj -> C:UsersAFCM_sourcereposOpenSceneGraph-OpenSceneGraph-3.6.0OpenSceneGraph-OpenSceneGraph-3.6.0buildbinosgPlugins-3.6.0osgdb_zipd.dll
56>osgdb_ive.vcxproj -> C:UsersAFCM_sourcereposOpenSceneGraph-OpenSceneGraph-3.6.0OpenSceneGraph-OpenSceneGraph-3.6.0buildbinosgPlugins-3.6.0osgdb_ived.dll
110>------ Compilação iniciada: Projeto: ALL_BUILD, Configuração: Debug x64 ------
========== Compilar: 105 com êxito, 5 com falha, 3 atualizados, 0 ignorados ==========



tl:dr

39>Projeto de compilação pronto "osgdb_deprecated_osganimation.vcxproj" -- FALHA.
40>Projeto de compilação pronto "osgdb_deprecated_osgparticle.vcxproj" -- FALHA.
43>Projeto de compilação pronto "osgdb_deprecated_osgterrain.vcxproj" -- FALHA.
90>Projeto de compilação pronto "osgdb_serializers_osganimation.vcxproj" -- FALHA.
93>Projeto de compilação pronto "osgdb_serializers_osgmanipulator.vcxproj" -- FALHA.
========== Compilar: 105 sucessfull, 5 failed, 3 updated, 0 ignored==========


Afterwards I just built INSTALL

Heres the result:

Code:

1>------ Compilação iniciada: Projeto: Plugins osg deprecated osganimation, Configuração: Debug x64 ------
2>------ Compilação iniciada: Projeto: Plugins osg deprecated osgparticle, Configuração: Debug x64 ------
3>------ Compilação iniciada: Projeto: Plugins osg deprecated osgterrain, Configuração: Debug x64 ------
1>C:Program Files (x86)Microsoft Visual Studio2017CommunityCommon7IDEVCVCTargetsMicrosoft.CppBuild.targets(321,5): error MSB3491: Não foi possível gravar linhas no arquivo "osgdb_deprecated_osganimation.dirDebugPlugins .C844942A.tlogPlugins osg deprecated osganimation.lastbuildstate". O caminho e nome de ficheiro especificados, ou ambos, são demasiado grandes. O nome de ficheiro totalmente qualificado tem de ser inferior a 260 caracteres e o nome do directório tem de ser inferior a 248 caracteres.
1>Projeto de compilação pronto "osgdb_deprecated_osganimation.vcxproj" -- FALHA.
2>C:Program Files (x86)Microsoft Visual Studio2017CommunityCommon7IDEVCVCTargetsMicrosoft.CppBuild.targets(321,5): error MSB3491: Não foi possível gravar linhas no arquivo "osgdb_deprecated_osgparticle.dirDebugPlugins .AF305535.tlogPlugins osg deprecated osgparticle.lastbuildstate". O caminho e nome de ficheiro especificados, ou ambos, são demasiado grandes. O nome de ficheiro totalmente qual
Back to top
View user's profile Send private message
Voerman, L.
Guest





PostPosted: Thu Apr 19, 2018 10:32 pm    Post subject:
Building OpenSceneGraph-3.6.0 on Windows 10 with VS2017
Reply with quote

Your compiler seems to be complaining about the paths being too long. Move the source tree to a shorter path before running cmake again.Laurens.


On Thu, Apr 19, 2018 at 8:39 PM, Ravi Mathur < (
Only registered users can see emails on this board!
Get registred or enter the forums!
)> wrote:
Quote:
Things you are doing wrong in CMake:
  • Do NOT change CMAKE_INCLUDE_PATH or CMAKE_LIBRARY_PATH.
  • Set ACTUAL_3RDPARTY_DIR to the path to 3rd-party x64 folder (containing bin, include, lib, etc). It will be something like C:pathto3rdParty_x64x64
  • If your ACTUAL_3RDPARTY_DIR is set correctly, then all the dependencies should be found automatically. You shouldn't have to mess with CMAKE_* variables to find them.
  • Set CMAKE_INSTALL_PREFIX to some location you have access to. Your INSTALL step says "file cannot create directory: C:/ProgramFiles/OpenSceneGraph/lib/pkgconfig. Maybe need administrative privileges." You clearly don't have Admin privileges.
  • If you really do want to install OSG to C:ProgramFiles, then run Visual Studio in Administrator mode.
Things you *might* be doing wrong in CMake:
  • Make sure you are building out-of-source, e.g. "Where is the source code" and "Where to build the binaries" should not be the same folder in CMake-GUI. I always make the build folder a sub-directory of the source folder.
Make sure you delete your current build folder, since you've already messed with things too much to fix. Delete the folder, start CMake from scratch, and follow the above guidelines.


Ravi

On Thu, Apr 19, 2018 at 12:44 PM, André Martins < (
Only registered users can see emails on this board!
Get registred or enter the forums!
)> wrote:
Quote:
Hi,
I would like to request some help since I've been unable to build the project using CMake and VS2017.
It's my first time building such a huge project and seems overwhelming at first.
I tried searching online, in the forum and in the openscenegraph website but none of the options worked...

What I've done:

Downloaded the source code from:
github .com/openscenegraph/OpenSceneGraph/tree/OpenSceneGraph-3.6.0

Downloaded dependencies from:
download.osgvisual .org/3rdParty_VS2017_v141_x64_V11_full.7z

CmakeSetup on Cmake 3.11.1:
Visual Studio 15 2014 Win64
Use default native compilers



Upon CMake Generation I edited CMAKE_INCLUDE_PATH and CMAKE_LIBRARY_PATH to match the dependencies include and lib folders, respectively.
I also updated SLD2_INCLUDE_DIR AND SDL2_LIBRARY_LIB sinca I had already compiled SDL2 previously.
Here's the output:



Code:
CMake Deprecation Warning at CMakeLists.txt:40 (cmake_policy):
  The OLD behavior for policy CMP0008 will be removed from a future version
  of CMake.

  The cmake-policies(7) manual explains that the OLD behaviors of all
  policies are deprecated and that a policy should be set to OLD only under
  specific short-term circumstances.  Projects should be ported to the NEW
  behavior and not rely on setting a policy to OLD.


Could NOT find EGL (missing: EGL_LIBRARY EGL_INCLUDE_DIR)
Checking windows version...
64 bit architecture detected
Could NOT find Freetype (missing: FREETYPE_LIBRARY) (found version "2.7.1")
Could NOT find Jasper (missing: JASPER_LIBRARIES JASPER_INCLUDE_DIR)
Could NOT find PkgConfig (missing: PKG_CONFIG_EXECUTABLE)
Trying to find DCMTK expecting DCMTKConfig.cmake
Trying to find DCMTK expecting DCMTKConfig.cmake - failed
Trying to find DCMTK relying on FindDCMTK.cmake
Please set DCMTK_DIR and re-run configure (missing: DCMTK_config_INCLUDE_DIR DCMTK_dcmdata_INCLUDE_DIR DCMTK_dcmimage_INCLUDE_DIR DCMTK_dcmimgle_INCLUDE_DIR DCMTK_dcmjpeg_INCLUDE_DIR DCMTK_dcmjpls_INCLUDE_DIR DCMTK_dcmnet_INCLUDE_DIR DCMTK_dcmpstat_INCLUDE_DIR DCMTK_dcmqrdb_INCLUDE_DIR DCMTK_dcmsign_INCLUDE_DIR DCMTK_dcmsr_INCLUDE_DIR DCMTK_dcmtls_INCLUDE_DIR DCMTK_ofstd_INCLUDE_DIR DCMTK_oflog_INCLUDE_DIR)
Trying to find DCMTK relying on FindDCMTK.cmake - ok
Could NOT find GStreamer (missing: GSTREAMER_INCLUDE_DIRS GSTREAMER_LIBRARIES GSTREAMER_VERSION GSTREAMER_BASE_INCLUDE_DIRS GSTREAMER_BASE_LIBRARIES GSTREAMER_APP_INCLUDE_DIRS GSTREAMER_APP_LIBRARIES GSTREAMER_PBUTILS_INCLUDE_DIRS GSTREAMER_PBUTILS_LIBRARIES)
Could NOT find SDL (missing: SDL_LIBRARY SDL_INCLUDE_DIR)
Could NOT find PkgConfig (missing: PKG_CONFIG_EXECUTABLE)
Could NOT find PkgConfig (missing: PKG_CONFIG_EXECUTABLE)
Could NOT find PkgConfig (missing: PKG_CONFIG_EXECUTABLE)
Configuring done
Generating done





After that I opened the solution on VS2017 and built ALL_BUILD

Heres the result:

Code:

1>------ Compilação iniciada: Projeto: ZERO_CHECK, Configuração: Debug x64 ------
2>------ Compilação iniciada: Projeto: osgDB, Configuração: Debug x64 ------
2>ObjectWrapper.cpp
2>InputStream.cpp
2>OutputStream.cpp
2>Compressors.cpp
2>Archive.cpp
2>AuthenticationMap.cpp
2>Callbacks.cpp
2>ClassInterface.cpp
2>ConvertBase64.cpp
2>ConvertUTF.cpp
2>DatabasePager.cpp
2>DatabaseRevisions.cpp
2>DotOsgWrapper.cpp
2>DynamicLibrary.cpp
2>ExternalFileWriter.cpp
2>Field.cpp
2>FieldReader.cpp
2>FieldReaderIterator.cpp
2>FileCache.cpp
2>FileNameUtils.cpp
2>Gerando Código...
2>Compilando...
2>FileUtils.cpp
2>fstream.cpp
2>ImageOptions.cpp
2>ImagePager.cpp
2>Input.cpp
2>MimeTypes.cpp
2>ObjectCache.cpp
2>Output.cpp
2>Options.cpp
2>PluginQuery.cpp
2>ReaderWriter.cpp
2>ReadFile.cpp
2>Registry.cpp
2>SharedStateManager.cpp
2>StreamOperator.cpp
2>Version.cpp
2>WriteFile.cpp
2>XmlParser.cpp
2>Gerando Código...
2>   Criando biblioteca C:/Users/AFCM_/source/repos/OpenSceneGraph-OpenSceneGraph-3.6.0/OpenSceneGraph-OpenSceneGraph-3.6.0/build/lib/osgDBd.lib e objeto C:/Users/AFCM_/source/repos/OpenSceneGraph-OpenSceneGraph-3.6.0/OpenSceneGraph-OpenSceneGraph-3.6.0/build/lib/osgDBd.exp
2>osgDB.vcxproj -> C:UsersAFCM_sourcereposOpenSceneGraph-OpenSceneGraph-3.6.0OpenSceneGraph-OpenSceneGraph-3.6.0buildbinosg156-osgDBd.dll
3>------ Compilação iniciada: Projeto: osgText, Configuração: Debug x64 ------
4>------ Compilação iniciada: Projeto: osgGA, Configuração: Debug x64 ------
5>------ Compilação iniciada: Projeto: osgFX, Configuração: Debug x64 ------
6>------ Compilação iniciada: Projeto: osgParticle, Configuração: Debug x64 ------
7>------ Compilação iniciada: Projeto: osgShadow, Configuração: Debug x64 ------
8>------ Compilação iniciada: Projeto: osgTerrain, Configuração: Debug x64 ------
9>------ Compilação iniciada: Projeto: Plugins trk, Configuração: Debug x64 ------
10>------ Compilação iniciada: Projeto: Plugins vtf, Configuração: Debug x64 ------
5>   Criando biblioteca C:/Users/AFCM_/source/repos/OpenSceneGraph-OpenSceneGraph-3.6.0/OpenSceneGraph-OpenSceneGraph-3.6.0/build/lib/osgFXd.lib e objeto C:/Users/AFCM_/source/repos/OpenSceneGraph-OpenSceneGraph-3.6.0/OpenSceneGraph-OpenSceneGraph-3.6.0/build/lib/osgFXd.exp
3>   Criando biblioteca C:/Users/AFCM_/source/repos/OpenSceneGraph-OpenSceneGraph-3.6.0/OpenSceneGraph-OpenSceneGraph-3.6.0/build/lib/osgTextd.lib e objeto C:/Users/AFCM_/source/repos/OpenSceneGraph-OpenSceneGraph-3.6.0/OpenSceneGraph-OpenSceneGraph-3.6.0/build/lib/osgTextd.exp
4>   Criando biblioteca C:/Users/AFCM_/source/repos/OpenSceneGraph-OpenSceneGraph-3.6.0/OpenSceneGraph-OpenSceneGraph-3.6.0/build/lib/osgGAd.lib e objeto C:/Users/AFCM_/source/repos/OpenSceneGraph-OpenSceneGraph-3.6.0/OpenSceneGraph-OpenSceneGraph-3.6.0/build/lib/osgGAd.exp
8>   Criando biblioteca C:/Users/AFCM_/source/repos/OpenSceneGraph-OpenSceneGraph-3.6.0/OpenSceneGraph-OpenSceneGraph-3.6.0/build/lib/osgTerraind.lib e objeto C:/Users/AFCM_/source/repos/OpenSceneGraph-OpenSceneGraph-3.6.0/OpenSceneGraph-OpenSceneGraph-3.6.0/build/lib/osgTerraind.exp
6>   Criando biblioteca C:/Users/AFCM_/source/repos/OpenSceneGraph-OpenSceneGraph-3.6.0/OpenSceneGraph-OpenSceneGraph-3.6.0/build/lib/osgParticled.lib e objeto C:/Users/AFCM_/source/repos/OpenSceneGraph-OpenSceneGraph-3.6.0/OpenSceneGraph-OpenSceneGraph-3.6.0/build/lib/osgParticled.exp
7>   Criando biblioteca C:/Users/AFCM_/source/repos/OpenSceneGraph-OpenSceneGraph-3.6.0/OpenSceneGraph-OpenSceneGraph-3.6.0/build/lib/osgShadowd.lib e objeto C:/Users/AFCM_/source/repos/OpenSceneGraph-OpenSceneGraph-3.6.0/OpenSceneGraph-OpenSceneGraph-3.6.0/build/lib/osgShadowd.exp
5>osgFX.vcxproj -> C:UsersAFCM_sourcereposOpenSceneGraph-OpenSceneGraph-3.6.0OpenSceneGraph-OpenSceneGraph-3.6.0buildbinosg156-osgFXd.dll
11>------ Compilação iniciada: Projeto: Plugins x, Configuração: Debug x64 ------
3>osgText.vcxproj -> C:UsersAFCM_sourcereposOpenSceneGraph-OpenSceneGraph-3.6.0OpenSceneGraph-OpenSceneGraph-3.6.0buildbinosg156-osgTextd.dll
9>osgdb_trk.vcxproj -> C:UsersAFCM_sourcereposOpenSceneGraph-OpenSceneGraph-3.6.0OpenSceneGraph-OpenSceneGraph-3.6.0buildbinosgPlugins-3.6.0osgdb_trkd.dll
4>osgGA.vcxproj -> C:UsersAFCM_sourcereposOpenSceneGraph-OpenSceneGraph-3.6.0OpenSceneGraph-OpenSceneGraph-3.6.0buildbinosg156-osgGAd.dll
10>osgdb_vtf.vcxproj -> C:UsersAFCM_sourcereposOpenSceneGraph-OpenSceneGraph-3.6.0OpenSceneGraph-OpenSceneGraph-3.6.0buildbinosgPlugins-3.6.0osgdb_vtfd.dll
8>osgTerrain.vcxproj -> C:UsersAFCM_sourcereposOpenSceneGraph-OpenSceneGraph-3.6.0OpenSceneGraph-OpenSceneGraph-3.6.0buildbinosg156-osgTerraind.dll
6>osgParticle.vcxproj -> C:UsersAFCM_sourcereposOpenSceneGraph-OpenSceneGraph-3.6.0OpenSceneGraph-OpenSceneGraph-3.6.0buildbinosg156-osgParticled.dll
11>osgdb_x.vcxproj -> C:UsersAFCM_sourcereposOpenSceneGraph-OpenSceneGraph-3.6.0OpenSceneGraph-OpenSceneGraph-3.6.0buildbinosgPlugins-3.6.0osgdb_xd.dll
7>osgShadow.vcxproj -> C:UsersAFCM_sourcereposOpenSceneGraph-OpenSceneGraph-3.6.0OpenSceneGraph-OpenSceneGraph-3.6.0buildbinosg156-osgShadowd.dll
12>------ Compilação iniciada: Projeto: Applications osgversion, Configuração: Debug x64 ------
13>------ Compilação iniciada: Projeto: osgViewer, Configuração: Debug x64 ------
14>------ Compilação iniciada: Projeto: osgVolume, Configuração: Debug x64 ------
15>------ Compilação iniciada: Projeto: osgSim, Configuração: Debug x64 ------
16>------ Compilação iniciada: Projeto: Plugins txf, Configuração: Debug x64 ------
17>------ Compilação iniciada: Projeto: Plugins zip, Configuração: Debug x64 ------
18>------ Compilação iniciada: Projeto: Plugins 3dc, Configuração: Debug x64 ------
19>------ Compilação iniciada: Projeto: Plugins 3ds, Configuração: Debug x64 ------
17>Building Custom Rule C:/Users/AFCM_/source/repos/OpenSceneGraph-OpenSceneGraph-3.6.0/OpenSceneGraph-OpenSceneGraph-3.6.0/src/osgPlugins/zip/CMakeLists.txt
17>CMake does not need to re-run because C:/Users/AFCM_/source/repos/OpenSceneGraph-OpenSceneGraph-3.6.0/OpenSceneGraph-OpenSceneGraph-3.6.0/build/src/osgPlugins/zip/CMakeFiles/generate.stamp is up-to-date.
15>   Criando biblioteca C:/Users/AFCM_/source/repos/OpenSceneGraph-OpenSceneGraph-3.6.0/OpenSceneGraph-OpenSceneGraph-3.6.0/build/lib/osgSimd.lib e objeto C:/Users/AFCM_/source/repos/OpenSceneGraph-OpenSceneGraph-3.6.0/OpenSceneGraph-OpenSceneGraph-3.6.0/build/lib/osgSimd.exp
14>   Criando biblioteca C:/Users/AFCM_/source/repos/OpenSceneGraph-OpenSceneGraph-3.6.0/OpenSceneGraph-OpenSceneGraph-3.6.0/build/lib/osgVolumed.lib e objeto C:/Users/AFCM_/source/repos/OpenSceneGraph-OpenSceneGraph-3.6.0/OpenSceneGraph-OpenSceneGraph-3.6.0/build/lib/osgVolumed.exp
17>unzip.cpp
13>   Criando biblioteca C:/Users/AFCM_/source/repos/OpenSceneGraph-OpenSceneGraph-3.6.0/OpenSceneGraph-OpenSceneGraph-3.6.0/build/lib/osgViewerd.lib e objeto C:/Users/AFCM_/source/repos/OpenSceneGraph-OpenSceneGraph-3.6.0/OpenSceneGraph-OpenSceneGraph-3.6.0/build/lib/osgViewerd.exp
12>application_osgversion.vcxproj -> C:UsersAFCM_sourcereposOpenSceneGraph-OpenSceneGraph-3.6.0OpenSceneGraph-OpenSceneGraph-3.6.0buildbinosgversiond.exe
20>------ Compilação iniciada: Projeto: Plugins ac, Configuração: Debug x64 ------
17>ZipArchive.cpp
16>osgdb_txf.vcxproj -> C:UsersAFCM_sourcereposOpenSceneGraph-OpenSceneGraph-3.6.0OpenSceneGraph-OpenSceneGraph-3.6.0buildbinosgPlugins-3.6.0osgdb_txfd.dll
21>------ Compilação iniciada: Projeto: Plugins bmp, Configuração: Debug x64 ------
18>osgdb_3dc.vcxproj -> C:UsersAFCM_sourcereposOpenSceneGraph-OpenSceneGraph-3.6.0OpenSceneGraph-OpenSceneGraph-3.6.0buildbinosgPlugins-3.6.0osgdb_3dcd.dll
22>------ Compilação iniciada: Projeto: Plugins bsp, Configuração: Debug x64 ------
14>osgVolume.vcxproj -> C:UsersAFCM_sourcereposOpenSceneGraph-OpenSceneGraph-3.6.0OpenSceneGraph-OpenSceneGraph-3.6.0buildbinosg156-osgVolumed.dll
19>osgdb_3ds.vcxproj -> C:UsersAFCM_sourcereposOpenSceneGraph-OpenSceneGraph-3.6.0OpenSceneGraph-OpenSceneGraph-3.6.0buildbinosgPlugins-3.6.0osgdb_3dsd.dll
23>------ Compilação iniciada: Projeto: Plugins curl, Configuração: Debug x64 ------
24>------ Compilação iniciada: Projeto: Plugins dds, Configuração: Debug x64 ------
23>Building Custom Rule C:/Users/AFCM_/source/repos/OpenSceneGraph-OpenSceneGraph-3.6.0/OpenSceneGraph-OpenSceneGraph-3.6.0/src/osgPlugins/curl/CMakeLists.txt
23>CMake does not need to re-run because C:/Users/AFCM_/source/repos/OpenSceneGraph-OpenSceneGraph-3.6.0/OpenSceneGraph-OpenSceneGraph-3.6.0/build/src/osgPlugins/curl/CMakeFiles/generate.stamp is up-to-date.
20>osgdb_ac.vcxproj -> C:UsersAFCM_sourcereposOpenSceneGraph-OpenSceneGraph-3.6.0OpenSceneGraph-OpenSceneGraph-3.6.0buildbinosgPlugins-3.6.0osgdb_acd.dll
15>osgSim.vcxproj -> C:UsersAFCM_sourcereposOpenSceneGraph-OpenSceneGraph-3.6.0OpenSceneGraph-OpenSceneGraph-3.6.0buildbinosg156-osgSimd.dll
21>osgdb_bmp.vcxproj -> C:UsersAFCM_sourcereposOpenSceneGraph-OpenSceneGraph-3.6.0OpenSceneGraph-OpenSceneGraph-3.6.0buildbinosgPlugins-3.6.0osgdb_bmpd.dll
25>------ Compilação iniciada: Projeto: Plugins osg deprecated osg, Configuração: Debug x64 ------
26>------ Compilação iniciada: Projeto: Plugins txp, Configuração: Debug x64 ------
13>osgViewer.vcxproj -> C:UsersAFCM_sourcereposOpenSceneGraph-OpenSceneGraph-3.6.0OpenSceneGraph-OpenSceneGraph-3.6.0buildbinosg156-osgViewerd.dll
27>------ Compilação iniciada: Projeto: Plugins osg deprecated osgfx, Configuração: Debug x64 ------
23>ReaderWriterCURL.cpp
28>------ Compilação iniciada: Projeto: osgManipulator, Configuração: Debug x64 ------
22>osgdb_bsp.vcxproj -> C:UsersAFCM_sourcereposOpenSceneGraph-OpenSceneGraph-3.6.0OpenSceneGraph-OpenSceneGraph-3.6.0buildbinosgPlugins-3.6.0osgdb_bspd.dll
29>------ Compilação iniciada: Projeto: osgUI, Configuração: Debug x64 ------
24>osgdb_dds.vcxproj -> C:UsersAFCM_sourcereposOpenSceneGraph-OpenSceneGraph-3.6.0OpenSceneGraph-OpenSceneGraph-3.6.0buildbinosgPlugins-3.6.0osgdb_ddsd.dll
30>------ Compilação iniciada: Projeto: osgWidget, Configuração: Debug x64 ------
28>   Criando biblioteca C:/Users/AFCM_/source/repos/OpenSceneGraph-OpenSceneGraph-3.6.0/OpenSceneGraph-OpenSceneGraph-3.6.0/build/lib/osgManipulatord.lib e objeto C:/Users/AFCM_/source/repos/OpenSceneGraph-OpenSceneGraph-3.6.0/OpenSceneGraph-OpenSceneGraph-3.6.0/build/lib/osgManipulatord.exp
29>   Criando biblioteca C:/Users/AFCM_/source/repos/OpenSceneGraph-OpenSceneGraph-3.6.0/OpenSceneGraph-OpenSceneGraph-3.6.0/build/lib/osgUId.lib e objeto C:/Users/AFCM_/source/repos/OpenSceneGraph-OpenSceneGraph-3.6.0/OpenSceneGraph-OpenSceneGraph-3.6.0/build/lib/osgUId.exp
27>osgdb_deprecated_osgfx.vcxproj -> C:UsersAFCM_sourcereposOpenSceneGraph-OpenSceneGraph-3.6.0OpenSceneGraph-OpenSceneGraph-3.6.0buildbinosgPlugins-3.6.0osgdb_deprecated_osgfxd.dll
31>------ Compilação iniciada: Projeto: osgAnimation, Configuração: Debug x64 ------
30>   Criando biblioteca C:/Users/AFCM_/source/repos/OpenSceneGraph-OpenSceneGraph-3.6.0/OpenSceneGraph-OpenSceneGraph-3.6.0/build/lib/osgWidgetd.lib e objeto C:/Users/AFCM_/source/repos/OpenSceneGraph-OpenSceneGraph-3.6.0/OpenSceneGraph-OpenSceneGraph-3.6.0/build/lib/osgWidgetd.exp
28>osgManipulator.vcxproj -> C:UsersAFCM_sourcereposOpenSceneGraph-OpenSceneGraph-3.6.0OpenSceneGraph-OpenSceneGraph-3.6.0buildbinosg156-osgManipulatord.dll
32>------ Compilação iniciada: Projeto: Applications osgarchive, Configuração: Debug x64 ------
29>osgUI.vcxproj -> C:UsersAFCM_sourcereposOpenSceneGraph-OpenSceneGraph-3.6.0OpenSceneGraph-OpenSceneGraph-3.6.0buildbinosg156-osgUId.dll
33>------ Compilação iniciada: Projeto: Applications osgconv, Configuração: Debug x64 ------
31>   Criando biblioteca C:/Users/AFCM_/source/repos/OpenSceneGraph-OpenSceneGraph-3.6.0/OpenSceneGraph-OpenSceneGraph-3.6.0/build/lib/osgAnimationd.lib e objeto C:/Users/AFCM_/source/repos/OpenSceneGraph-OpenSceneGraph-3.6.0/OpenSceneGraph-OpenSceneGraph-3.6.0/build/lib/osgAnimationd.exp
30>osgWidget.vcxproj -> C:UsersAFCM_sourcereposOpenSceneGraph-OpenSceneGraph-3.6.0OpenSceneGraph-OpenSceneGraph-3.6.0buildbinosg156-osgWidgetd.dll
34>------ Compilação iniciada: Projeto: osgPresentation, Configuração: Debug x64 ------
25>osgdb_deprecated_osg.vcxproj -> C:UsersAFCM_sourcereposOpenSceneGraph-OpenSceneGraph-3.6.0OpenSceneGraph-OpenSceneGraph-3.6.0buildbinosgPlugins-3.6.0osgdb_deprecated_osgd.dll
32>application_osgarchive.vcxproj -> C:UsersAFCM_sourcereposOpenSceneGraph-OpenSceneGraph-3.6.0OpenSceneGraph-OpenSceneGraph-3.6.0buildbinosgarchived.exe
35>------ Compilação iniciada: Projeto: Applications osgfilecache, Configuração: Debug x64 ------
36>------ Compilação iniciada: Projeto: Applications osgviewer, Configuração: Debug x64 ------
33>application_osgconv.vcxproj -> C:UsersAFCM_sourcereposOpenSceneGraph-OpenSceneGraph-3.6.0OpenSceneGraph-OpenSceneGraph-3.6.0buildbinosgconvd.exe
37>------ Compilação iniciada: Projeto: Plugins cfg, Configuração: Debug x64 ------
34>   Criando biblioteca C:/Users/AFCM_/source/repos/OpenSceneGraph-OpenSceneGraph-3.6.0/OpenSceneGraph-OpenSceneGraph-3.6.0/build/lib/osgPresentationd.lib e objeto C:/Users/AFCM_/source/repos/OpenSceneGraph-OpenSceneGraph-3.6.0/OpenSceneGraph-OpenSceneGraph-3.6.0/build/lib/osgPresentationd.exp
31>osgAnimation.vcxproj -> C:UsersAFCM_sourcereposOpenSceneGraph-OpenSceneGraph-3.6.0OpenSceneGraph-OpenSceneGraph-3.6.0buildbinosg156-osgAnimationd.dll
38>------ Compilação iniciada: Projeto: Plugins bvh, Configuração: Debug x64 ------
36>application_osgviewer.vcxproj -> C:UsersAFCM_sourcereposOpenSceneGraph-OpenSceneGraph-3.6.0OpenSceneGraph-OpenSceneGraph-3.6.0buildbinosgviewerd.exe
39>------ Compilação iniciada: Projeto: Plugins osg deprecated osganimation, Configuração: Debug x64 ------
39>C:Program Files (x86)Microsoft Visual Studio2017CommunityCommon7IDEVCVCTargetsMicrosoft.CppBuild.targets(321,5): error MSB3491: Não foi possível gravar linhas no arquivo "osgdb_deprecated_osganimation.dirDebugPlugins .C844942A.tlogPlugins osg deprecated osganimation.lastbuildstate". O caminho e nome de ficheiro especificados, ou ambos, são demasiado grandes. O nome de ficheiro totalmente qualificado tem de ser inferior a 260 caracteres e o nome do directório tem de ser inferior a 248 caracteres.
39>Projeto de compilação pronto "osgdb_deprecated_osganimation.vcxproj" -- FALHA.
40>------ Compilação iniciada: Projeto: Plugins osg deprecated osgparticle, Configuração: Debug x64 ------
40>C:Program Files (x86)Microsoft Visual Studio2017CommunityCommon7IDEVCVCTargetsMicrosoft.CppBuild.targets(321,5): error MSB3491: Não foi possível gravar linhas no arquivo "osgdb_deprecated_osgparticle.dirDebugPlugins .AF305535.tlogPlugins osg deprecated osgparticle.lastbuildstate". O caminho e nome de ficheiro especificados, ou ambos, são demasiado grandes. O nome de ficheiro totalmente qualificado tem de ser inferior a 260 caracteres e o nome do directório tem de ser inferior a 248 caracteres.
40>Projeto de compilação pronto "osgdb_deprecated_osgparticle.vcxproj" -- FALHA.
41>------ Compilação iniciada: Projeto: Plugins osg deprecated osgshadow, Configuração: Debug x64 ------
34>osgPresentation.vcxproj -> C:UsersAFCM_sourcereposOpenSceneGraph-OpenSceneGraph-3.6.0OpenSceneGraph-OpenSceneGraph-3.6.0buildbinosg156-osgPresentationd.dll
37>osgdb_cfg.vcxproj -> C:UsersAFCM_sourcereposOpenSceneGraph-OpenSceneGraph-3.6.0OpenSceneGraph-OpenSceneGraph-3.6.0buildbinosgPlugins-3.6.0osgdb_cfgd.dll
42>------ Compilação iniciada: Projeto: Plugins osg deprecated osgsim, Configuração: Debug x64 ------
17>ReaderWriterZIP.cpp
38>osgdb_bvh.vcxproj -> C:UsersAFCM_sourcereposOpenSceneGraph-OpenSceneGraph-3.6.0OpenSceneGraph-OpenSceneGraph-3.6.0buildbinosgPlugins-3.6.0osgdb_bvhd.dll
43>------ Compilação iniciada: Projeto: Plugins osg deprecated osgterrain, Configuração: Debug x64 ------
43>C:Program Files (x86)Microsoft Visual Studio2017CommunityCommon7IDEVCVCTargetsMicrosoft.CppBuild.targets(321,5): error MSB3491: Não foi possível gravar linhas no arquivo "osgdb_deprecated_osgterrain.dirDebugPlugins .E950791E.tlogPlugins osg deprecated osgterrain.lastbuildstate". O caminho e nome de ficheiro especificados, ou ambos, são demasiado grandes. O nome de ficheiro totalmente qualificado tem de ser inferior a 260 caracteres e o nome do directório tem de ser inferior a 248 caracteres.
43>Projeto de compilação pronto "osgdb_deprecated_osgterrain.vcxproj" -- FALHA.
44>------ Compilação iniciada: Projeto: Plugins osg deprecated osgtext, Configuração: Debug x64 ------
41>osgdb_deprecated_osgshadow.vcxproj -> C:UsersAFCM_sourcereposOpenSceneGraph-OpenSceneGraph-3.6.0OpenSceneGraph-OpenSceneGraph-3.6.0buildbinosgPlugins-3.6.0osgdb_deprecated_osgshadowd.dll
45>------ Compilação iniciada: Projeto: Plugins osg deprecated osgviewer, Configuração: Debug x64 ------
35>application_osgfilecache.vcxproj -> C:UsersAFCM_sourcereposOpenSceneGraph-OpenSceneGraph-3.6.0OpenSceneGraph-OpenSceneGraph-3.6.0buildbinosgfilecached.exe
42>osgdb_deprecated_osgsim.vcxproj -> C:UsersAFCM_sourcereposOpenSceneGraph-OpenSceneGraph-3.6.0OpenSceneGraph-OpenSceneGraph-3.6.0buildbinosgPlugins-3.6.0osgdb_deprecated_osgsimd.dll
46>------ Compilação iniciada: Projeto: Plugins osg deprecated osgvolume, Configuração: Debug x64 ------
44>osgdb_deprecated_osgtext.vcxproj -> C:UsersAFCM_sourcereposOpenSceneGraph-OpenSceneGraph-3.6.0OpenSceneGraph-OpenSceneGraph-3.6.0buildbinosgPlugins-3.6.0osgdb_deprecated_osgtextd.dll
47>------ Compilação iniciada: Projeto: Plugins osg deprecated osgwidget, Configuração: Debug x64 ------
26>osgdb_txp.vcxproj -> C:UsersAFCM_sourcereposOpenSceneGraph-OpenSceneGraph-3.6.0OpenSceneGraph-OpenSceneGraph-3.6.0buildbinosgPlugins-3.6.0osgdb_txpd.dll
45>osgdb_deprecated_osgviewer.vcxproj -> C:UsersAFCM_sourcereposOpenSceneGraph-OpenSceneGraph-3.6.0OpenSceneGraph-OpenSceneGraph-3.6.0buildbinosgPlugins-3.6.0osgdb_deprecated_osgviewerd.dll
48>------ Compilação iniciada: Projeto: Plugins dot, Configuração: Debug x64 ------
49>------ Compilação iniciada: Projeto: Applications present3D, Configuração: Debug x64 ------
50>------ Compilação iniciada: Projeto: Plugins dxf, Configuração: Debug x64 ------
46>osgdb_deprecated_osgvolume.vcxproj -> C:UsersAFCM_sourcereposOpenSceneGraph-OpenSceneGraph-3.6.0OpenSceneGraph-OpenSceneGraph-3.6.0buildbinosgPlugins-3.6.0osgdb_deprecated_osgvolumed.dll
51>------ Compilação iniciada: Projeto: Plugins gdal, Configuração: Debug x64 ------
52>------ Compilação iniciada: Projeto: Plugins gles, Configuração: Debug x64 ------
51>Building Custom Rule C:/Users/AFCM_/source/repos/OpenSceneGraph-OpenSceneGraph-3.6.0/OpenSceneGraph-OpenSceneGraph-3.6.0/src/osgPlugins/gdal/CMakeLists.txt
51>CMake does not need to re-run because C:/Users/AFCM_/source/repos/OpenSceneGraph-OpenSceneGraph-3.6.0/OpenSceneGraph-OpenSceneGraph-3.6.0/build/src/osgPlugins/gdal/CMakeFiles/generate.stamp is up-to-date.
47>osgdb_deprecated_osgwidget.vcxproj -> C:UsersAFCM_sourcereposOpenSceneGraph-OpenSceneGraph-3.6.0OpenSceneGraph-OpenSceneGraph-3.6.0buildbinosgPlugins-3.6.0osgdb_deprecated_osgwidgetd.dll
48>osgdb_dot.vcxproj -> C:UsersAFCM_sourcereposOpenSceneGraph-OpenSceneGraph-3.6.0OpenSceneGraph-OpenSceneGraph-3.6.0buildbinosgPlugins-3.6.0osgdb_dotd.dll
53>------ Compilação iniciada: Projeto: Plugins glsl, Configuração: Debug x64 ------
51>ReaderWriterGDAL.cpp
54>------ Compilação iniciada: Projeto: Plugins gz, Configuração: Debug x64 ------
54>Building Custom Rule C:/Users/AFCM_/source/repos/OpenSceneGraph-OpenSceneGraph-3.6.0/OpenSceneGraph-OpenSceneGraph-3.6.0/src/osgPlugins/gz/CMakeLists.txt
54>CMake does not need to re-run because C:/Users/AFCM_/source/repos/OpenSceneGraph-OpenSceneGraph-3.6.0/OpenSceneGraph-OpenSceneGraph-3.6.0/build/src/osgPlugins/gz/CMakeFiles/generate.stamp is up-to-date.
23>osgdb_curl.vcxproj -> C:UsersAFCM_sourcereposOpenSceneGraph-OpenSceneGraph-3.6.0OpenSceneGraph-OpenSceneGraph-3.6.0buildbinosgPlugins-3.6.0osgdb_curld.dll
55>------ Compilação iniciada: Projeto: Plugins hdr, Configuração: Debug x64 ------
54>ReaderWriterGZ.cpp
50>osgdb_dxf.vcxproj -> C:UsersAFCM_sourcereposOpenSceneGraph-OpenSceneGraph-3.6.0OpenSceneGraph-OpenSceneGraph-3.6.0buildbinosgPlugins-3.6.0osgdb_dxfd.dll
56>------ Compilação iniciada: Projeto: Plugins ive, Configuração: Debug x64 ------
53>osgdb_glsl.vcxproj -> C:UsersAFCM_sourcereposOpenSceneGraph-OpenSceneGraph-3.6.0OpenSceneGraph-OpenSceneGraph-3.6.0buildbinosgPlugins-3.6.0osgdb_glsld.dll
57>------ Compilação iniciada: Projeto: Plugins jpeg, Configuração: Debug x64 ------
57>Building Custom Rule C:/Users/AFCM_/source/repos/OpenSceneGraph-OpenSceneGraph-3.6.0/OpenSceneGraph-OpenSceneGraph-3.6.0/src/osgPlugins/jpeg/CMakeLists.txt
57>CMake does not need to re-run because C:/Users/AFCM_/source/repos/OpenSceneGraph-OpenSceneGraph-3.6.0/OpenSceneGraph-OpenSceneGraph-3.6.0/build/src/osgPlugins/jpeg/CMakeFiles/generate.stamp is up-to-date.
57>EXIF_Orientation.cpp
56>AlphaFunc.cpp
55>osgdb_hdr.vcxproj -> C:UsersAFCM_sourcereposOpenSceneGraph-OpenSceneGraph-3.6.0OpenSceneGraph-OpenSceneGraph-3.6.0buildbinosgPlugins-3.6.0osgdb_hdrd.dll
58>------ Compilação iniciada: Projeto: Plugins ktx, Configuração: Debug x64 ------
57>ReaderWriterJPEG.cpp
49>application_present3D.vcxproj -> C:UsersAFCM_sourcereposOpenSceneGraph-OpenSceneGraph-3.6.0OpenSceneGraph-OpenSceneGraph-3.6.0buildbinpresent3Dd.exe
52>osgdb_gles.vcxproj -> C:UsersAFCM_sourcereposOpenSceneGraph-OpenSceneGraph-3.6.0OpenSceneGraph-OpenSceneGraph-3.6.0buildbinosgPlugins-3.6.0osgdb_glesd.dll
59>------ Compilação iniciada: Projeto: Plugins logo, Configuração: Debug x64 ------
58>osgdb_ktx.vcxproj -> C:UsersAFCM_sourcereposOpenSceneGraph-OpenSceneGraph-3.6.0OpenSceneGraph-OpenSceneGraph-3.6.0buildbinosgPlugins-3.6.0osgdb_ktxd.dll
60>------ Compilação iniciada: Projeto: Plugins lua, Configuração: Debug x64 ------
17>Gerando Código...
59>osgdb_logo.vcxproj -> C:UsersAFCM_sourcereposOpenSceneGraph-OpenSceneGraph-3.6.0OpenSceneGraph-OpenSceneGraph-3.6.0buildbinosgPlugins-3.6.0osgdb_logod.dll
61>------ Compilação iniciada: Projeto: Plugins lwo, Configuração: Debug x64 ------
62>------ Compilação iniciada: Projeto: Plugins lws, Configuração: Debug x64 ------
60>osgdb_lua.vcxproj -> C:UsersAFCM_sourcereposOpenSceneGraph-OpenSceneGraph-3.6.0OpenSceneGraph-OpenSceneGraph-3.6.0buildbinosgPlugins-3.6.0osgdb_luad.dll
63>------ Compilação iniciada: Projeto: Plugins md2, Configuração: Debug x64 ------
62>osgdb_lws.vcxproj -> C:UsersAFCM_sourcereposOpenSceneGraph-OpenSceneGraph-3.6.0OpenSceneGraph-OpenSceneGraph-3.6.0buildbinosgPlugins-3.6.0osgdb_lwsd.dll
64>------ Compilação iniciada: Projeto: Plugins mdl, Configuração: Debug x64 ------
61>osgdb_lwo.vcxproj -> C:UsersAFCM_sourcereposOpenSceneGraph-OpenSceneGraph-3.6.0OpenSceneGraph-OpenSceneGraph-3.6.0buildbinosgPlugins-3.6.0osgdb_lwod.dll
65>------ Compilação iniciada: Projeto: Plugins normals, Configuração: Debug x64 ------
66>------ Compilação iniciada: Projeto: Plugins nvtt, Configuração: Debug x64 ------
66>Building Custom Rule C:/Users/AFCM_/source/repos/OpenSceneGraph-OpenSceneGraph-3.6.0/OpenSceneGraph-OpenSceneGraph-3.6.0/src/osgPlugins/nvtt/CMakeLists.txt
66>CMake does not need to re-run because C:/Users/AFCM_/source/repos/OpenSceneGraph-OpenSceneGraph-3.6.0/OpenSceneGraph-OpenSceneGraph-3.6.0/build/src/osgPlugins/nvtt/CMakeFiles/generate.stamp is up-to-date.
66>NVTTImageProcessor.cpp
64>osgdb_mdl.vcxproj -> C:UsersAFCM_sourcereposOpenSceneGraph-OpenSceneGraph-3.6.0OpenSceneGraph-OpenSceneGraph-3.6.0buildbinosgPlugins-3.6.0osgdb_mdld.dll
67>------ Compilação iniciada: Projeto: Plugins obj, Configuração: Debug x64 ------
51>DataSetLayer.cpp
65>osgdb_normals.vcxproj -> C:UsersAFCM_sourcereposOpenSceneGraph-OpenSceneGraph-3.6.0OpenSceneGraph-OpenSceneGraph-3.6.0buildbinosgPlugins-3.6.0osgdb_normalsd.dll
68>------ Compilação iniciada: Projeto: Plugins ogr, Configuração: Debug x64 ------
67>osgdb_obj.vcxproj -> C:UsersAFCM_sourcereposOpenSceneGraph-OpenSceneGraph-3.6.0OpenSceneGraph-OpenSceneGraph-3.6.0buildbinosgPlugins-3.6.0osgdb_objd.dll
69>------ Compilação iniciada: Projeto: Plugins openflight, Configuração: Debug x64 ------
54>osgdb_gz.vcxproj -> C:UsersAFCM_sourcereposOpenSceneGraph-OpenSceneGraph-3.6.0OpenSceneGraph-OpenSceneGraph-3.6.0buildbinosgPlugins-3.6.0osgdb_gzd.dll
70>------ Compilação iniciada: Projeto: Plugins osc, Configuração: Debug x64 ------
56>AnimationPathCallback.cpp
57>Gerando Código...
57>jpeg.lib(jerror.obj) : MSIL .netmodule ou módulo compilado com /GL encontrado; reiniciando link com /LTCG; adicione /LTCG ao link da linha de comando para melhorar performance do vinculador
57>LINK : warning LNK4075: ignorando '/INCREMENTAL' devido a especificaþÒo '/LTCG'
57>LINK : warning LNK4098: defaultlib 'MSVCRT' conflita com uso de outras bibliotecas; use /NODEFAULTLIB:library
57>Gerando c¾digo
71>------ Compilação iniciada: Projeto: Plugins osg, Configuração: Debug x64 ------
57>Finalizada a geraþÒo de c¾digo
57>jpeg.lib(jerror.obj) : warning LNK4099: PDB 'jpeg.pdb' nÒo foi encontrado 'jpeg.lib(jerror.obj)' ou no 'C:UsersAFCM_sourcereposOpenSceneGraph-OpenSceneGraph-3.6.0OpenSceneGraph-OpenSceneGraph-3.6.0buildbinosgPlugins-3.6.0jpeg.pdb'; vinculando objeto quando quando sem nenhuma informaþÒo de depuraþÒo
69>osgdb_openflight.vcxproj -> C:UsersAFCM_sourcereposOpenSceneGraph-OpenSceneGraph-3.6.0OpenSceneGraph-OpenSceneGraph-3.6.0buildbinosgPlugins-3.6.0osgdb_openflightd.dll
72>------ Compilação iniciada: Projeto: Plugins osga, Configuração: Debug x64 ------
57>jpeg.lib(jcapimin.obj) : warning LNK4099: PDB 'jpeg.pdb' nÒo foi encontrado 'jpeg.lib(jcapimin.obj)' ou no 'C:UsersAFCM_sourcereposOpenSceneGraph-OpenSceneGraph-3.6.0OpenSceneGraph-OpenSceneGraph-3.6.0buildbinosgPlugins-3.6.0jpeg.pdb'; vinculando objeto quando quando sem nenhuma informaþÒo de depuraþÒo
57>jpeg.lib(jdapimin.obj) : warning LNK4099: PDB 'jpeg.pdb' nÒo foi encontrado 'jpeg.lib(jdapimin.obj)' ou no 'C:UsersAFCM_sourcereposOpenSceneGraph-OpenSceneGraph-3.6.0OpenSceneGraph-OpenSceneGraph-3.6.0buildbinosgPlugins-3.6.0jpeg.pdb'; vinculando objeto quando quando sem nenhuma informaþÒo de depuraþÒo
57>jpeg.lib(jcparam.obj) : warning LNK4099: PDB 'jpeg.pdb' nÒo foi encontrado 'jpeg.lib(jcparam.obj)' ou no 'C:UsersAFCM_sourcereposOpenSceneGraph-OpenSceneGraph-3.6.0OpenSceneGraph-OpenSceneGraph-3.6.0buildbinosgPlugins-3.6.0jpeg.pdb'; vinculando objeto quando quando sem nenhuma informaþÒo de depuraþÒo
57>jpeg.lib(jcapistd.obj) : warning LNK4099: PDB 'jpeg.pdb' nÒo foi encontrado 'jpeg.lib(jcapistd.obj)' ou no 'C:UsersAFCM_sourcereposOpenSceneGraph-OpenSceneGraph-3.6.0OpenSceneGraph-OpenSceneGraph-3.6.0buildbinosgPlugins-3.6.0jpeg.pdb'; vinculando objeto quando quando sem nenhuma informaþÒo de depuraþÒo
57>jpeg.lib(jdapistd.obj) : warning LNK4099: PDB 'jpeg.pdb' nÒo foi encontrado 'jpeg.lib(jdapistd.obj)' ou no 'C:UsersAFCM_sourcereposOpenSceneGraph-OpenSceneGraph-3.6.0OpenSceneGraph-OpenSceneGraph-3.6.0buildbinosgPlugins-3.6.0jpeg.pdb'; vinculando objeto quando quando sem nenhuma informaþÒo de depuraþÒo
57>jpeg.lib(jdmarker.obj) : warning LNK4099: PDB 'jpeg.pdb' nÒo foi encontrado 'jpeg.lib(jdmarker.obj)' ou no 'C:UsersAFCM_sourcereposOpenSceneGraph-OpenSceneGraph-3.6.0OpenSceneGraph-OpenSceneGraph-3.6.0buildbinosgPlugins-3.6.0jpeg.pdb'; vinculando objeto quando quando sem nenhuma informaþÒo de depuraþÒo
57>jpeg.lib(jcomapi.obj) : warning LNK4099: PDB 'jpeg.pdb' nÒo foi encontrado 'jpeg.lib(jcomapi.obj)' ou no 'C:UsersAFCM_sourcereposOpenSceneGraph-OpenSceneGraph-3.6.0OpenSceneGraph-OpenSceneGraph-3.6.0buildbinosgPlugins-3.6.0jpeg.pdb'; vinculando objeto quando quando sem nenhuma informaþÒo de depuraþÒo
57>jpeg.lib(jutils.obj) : warning LNK4099: PDB 'jpeg.pdb' nÒo foi encontrado 'jpeg.lib(jutils.obj)' ou no 'C:UsersAFCM_sourcereposOpenSceneGraph-OpenSceneGraph-3.6.0OpenSceneGraph-OpenSceneGraph-3.6.0buildbinosgPlugins-3.6.0jpeg.pdb'; vinculando objeto quando quando sem nenhuma informaþÒo de depuraþÒo
57>jpeg.lib(jmemmgr.obj) : warning LNK4099: PDB 'jpeg.pdb' nÒo foi encontrado 'jpeg.lib(jmemmgr.obj)' ou no 'C:UsersAFCM_sourcereposOpenSceneGraph-OpenSceneGraph-3.6.0OpenSceneGraph-OpenSceneGraph-3.6.0buildbinosgPlugins-3.6.0jpeg.pdb'; vinculando objeto quando quando sem nenhuma informaþÒo de depuraþÒo
57>jpeg.lib(jcmarker.obj) : warning LNK4099: PDB 'jpeg.pdb' nÒo foi encontrado 'jpeg.lib(jcmarker.obj)' ou no 'C:UsersAFCM_sourcereposOpenSceneGraph-OpenSceneGraph-3.6.0OpenSceneGraph-OpenSceneGraph-3.6.0buildbinosgPlugins-3.6.0jpeg.pdb'; vinculando objeto quando quando sem nenhuma informaþÒo de depuraþÒo
57>jpeg.lib(jdinput.obj) : warning LNK4099: PDB 'jpeg.pdb' nÒo foi encontrado 'jpeg.lib(jdinput.obj)' ou no 'C:UsersAFCM_sourcereposOpenSceneGraph-OpenSceneGraph-3.6.0OpenSceneGraph-OpenSceneGraph-3.6.0buildbinosgPlugins-3.6.0jpeg.pdb'; vinculando objeto quando quando sem nenhuma informaþÒo de depuraþÒo
57>jpeg.lib(jcinit.obj) : warning LNK4099: PDB 'jpeg.pdb' nÒo foi encontrado 'jpeg.lib(jcinit.obj)' ou no 'C:UsersAFCM_sourcereposOpenSceneGraph-OpenSceneGraph-3.6.0OpenSceneGraph-OpenSceneGraph-3.6.0buildbinosgPlugins-3.6.0jpeg.pdb'; vinculando objeto quando quando sem nenhuma informaþÒo de depuraþÒo
57>jpeg.lib(jdmaster.obj) : warning LNK4099: PDB 'jpeg.pdb' nÒo foi encontrado 'jpeg.lib(jdmaster.obj)' ou no 'C:UsersAFCM_sourcereposOpenSceneGraph-OpenSceneGraph-3.6.0OpenSceneGraph-OpenSceneGraph-3.6.0buildbinosgPlugins-3.6.0jpeg.pdb'; vinculando objeto quando quando sem nenhuma informaþÒo de depuraþÒo
57>jpeg.lib(jmemnobs.obj) : warning LNK4099: PDB 'jpeg.pdb' nÒo foi encontrado 'jpeg.lib(jmemnobs.obj)' ou no 'C:UsersAFCM_sourcereposOpenSceneGraph-OpenSceneGraph-3.6.0OpenSceneGraph-OpenSceneGraph-3.6.0buildbinosgPlugins-3.6.0jpeg.pdb'; vinculando objeto quando quando sem nenhuma informaþÒo de depuraþÒo
57>jpeg.lib(jcarith.obj) : warning LNK4099: PDB 'jpeg.pdb' nÒo foi encontrado 'jpeg.lib(jcarith.obj)' ou no 'C:UsersAFCM_sourcereposOpenSceneGraph-OpenSceneGraph-3.6.0OpenSceneGraph-OpenSceneGraph-3.6.0buildbinosgPlugins-3.6.0jpeg.pdb'; vinculando objeto quando quando sem nenhuma informaþÒo de depuraþÒo
57>jpeg.lib(jcprepct.obj) : warning LNK4099: PDB 'jpeg.pdb' nÒo foi encontrado 'jpeg.lib(jcprepct.obj)' ou no 'C:UsersAFCM_sourcereposOpenSceneGraph-OpenSceneGraph-3.6.0OpenSceneGraph-OpenSceneGraph-3.6.0buildbinosgPlugins-3.6.0jpeg.pdb'; vinculando objeto quando quando sem nenhuma informaþÒo de depuraþÒo
57>jpeg.lib(jcsample.obj) : warning LNK4099: PDB 'jpeg.pdb' nÒo foi encontrado 'jpeg.lib(jcsample.obj)' ou no 'C:UsersAFCM_sourcereposOpenSceneGraph-OpenSceneGraph-3.6.0OpenSceneGraph-OpenSceneGraph-3.6.0buildbinosgPlugins-3.6.0jpeg.pdb'; vinculando objeto quando quando sem nenhuma informaþÒo de depuraþÒo
57>jpeg.lib(jcmainct.obj) : warning LNK4099: PDB 'jpeg.pdb' nÒo foi encontrado 'jpeg.lib(jcmainct.obj)' ou no 'C:UsersAFCM_sourcereposOpenSceneGraph-OpenSceneGraph-3.6.0OpenSceneGraph-OpenSceneGraph-3.6.0buildbinosgPlugins-3.6.0jpeg.pdb'; vinculando objeto quando quando sem nenhuma informaþÒo de depuraþÒo
57>jpeg.lib(jcmaster.obj) : warning LNK4099: PDB 'jpeg.pdb' nÒo foi encontrado 'jpeg.lib(jcmaster.obj)' ou no 'C:UsersAFCM_sourcereposOpenSceneGraph-OpenSceneGraph-3.6.0OpenSceneGraph-OpenSceneGraph-3.6.0buildbinosgPlugins-3.6.0jpeg.pdb'; vinculando objeto quando quando sem nenhuma informaþÒo de depuraþÒo
57>jpeg.lib(jccoefct.obj) : warning LNK4099: PDB 'jpeg.pdb' nÒo foi encontrado 'jpeg.lib(jccoefct.obj)' ou no 'C:UsersAFCM_sourcereposOpenSceneGraph-OpenSceneGraph-3.6.0OpenSceneGraph-OpenSceneGraph-3.6.0buildbinosgPlugins-3.6.0jpeg.pdb'; vinculando objeto quando quando sem nenhuma informaþÒo de depuraþÒo
57>jpeg.lib(jccolor.obj) : warning LNK4099: PDB 'jpeg.pdb' nÒo foi encontrado 'jpeg.lib(jccolor.obj)' ou no 'C:UsersAFCM_sourcereposOpenSceneGraph-OpenSceneGraph-3.6.0OpenSceneGraph-OpenSceneGraph-3.6.0buildbinosgPlugins-3.6.0jpeg.pdb'; vinculando objeto quando quando sem nenhuma informaþÒo de depuraþÒo
57>jpeg.lib(jchuff.obj) : warning LNK4099: PDB 'jpeg.pdb' nÒo foi encontrado 'jpeg.lib(jchuff.obj)' ou no 'C:UsersAFCM_sourcereposOpenSceneGraph-OpenSceneGraph-3.6.0OpenSceneGraph-OpenSceneGraph-3.6.0buildbinosgPlugins-3.6.0jpeg.pdb'; vinculando objeto quando quando sem nenhuma informaþÒo de depuraþÒo
57>jpeg.lib(jcdctmgr.obj) : warning LNK4099: PDB 'jpeg.pdb' nÒo foi encontrado 'jpeg.lib(jcdctmgr.obj)' ou no 'C:UsersAFCM_sourcereposOpenSceneGraph-OpenSceneGraph-3.6.0OpenSceneGraph-OpenSceneGraph-3.6.0buildbinosgPlugins-3.6.0jpeg.pdb'; vinculando objeto quando quando sem nenhuma informaþÒo de depuraþÒo
57>jpeg.lib(jquant1.obj) : warning LNK4099: PDB 'jpeg.pdb' nÒo foi encontrado 'jpeg.lib(jquant1.obj)' ou no 'C:UsersAFCM_sourcereposOpenSceneGraph-OpenSceneGraph-3.6.0OpenSceneGraph-OpenSceneGraph-3.6.0buildbinosgPlugins-3.6.0jpeg.pdb'; vinculando objeto quando quando sem nenhuma informaþÒo de depuraþÒo
57>jpeg.lib(jdmerge.obj) : warning LNK4099: PDB 'jpeg.pdb' nÒo foi encontrado 'jpeg.lib(jdmerge.obj)' ou no 'C:UsersAFCM_sourcereposOpenSceneGraph-OpenSceneGraph-3.6.0OpenSceneGraph-OpenSceneGraph-3.6.0buildbinosgPlugins-3.6.0jpeg.pdb'; vinculando objeto quando quando sem nenhuma informaþÒo de depuraþÒo
57>jpeg.lib(jdsample.obj) : warning LNK4099: PDB 'jpeg.pdb' nÒo foi encontrado 'jpeg.lib(jdsample.obj)' ou no 'C:UsersAFCM_sourcereposOpenSceneGraph-OpenSceneGraph-3.6.0OpenSceneGraph-OpenSceneGraph-3.6.0buildbinosgPlugins-3.6.0jpeg.pdb'; vinculando objeto quando quando sem nenhuma informaþÒo de depuraþÒo
57>jpeg.lib(jdhuff.obj) : warning LNK4099: PDB 'jpeg.pdb' nÒo foi encontrado 'jpeg.lib(jdhuff.obj)' ou no 'C:UsersAFCM_sourcereposOpenSceneGraph-OpenSceneGraph-3.6.0OpenSceneGraph-OpenSceneGraph-3.6.0buildbinosgPlugins-3.6.0jpeg.pdb'; vinculando objeto quando quando sem nenhuma informaþÒo de depuraþÒo
57>jpeg.lib(jquant2.obj) : warning LNK4099: PDB 'jpeg.pdb' nÒo foi encontrado 'jpeg.lib(jquant2.obj)' ou no 'C:UsersAFCM_sourcereposOpenSceneGraph-OpenSceneGraph-3.6.0OpenSceneGraph-OpenSceneGraph-3.6.0buildbinosgPlugins-3.6.0jpeg.pdb'; vinculando objeto quando quando sem nenhuma informaþÒo de depuraþÒo
57>jpeg.lib(jdarith.obj) : warning LNK4099: PDB 'jpeg.pdb' nÒo foi encontrado 'jpeg.lib(jdarith.obj)' ou no 'C:UsersAFCM_sourcereposOpenSceneGraph-OpenSceneGraph-3.6.0OpenSceneGraph-OpenSceneGraph-3.6.0buildbinosgPlugins-3.6.0jpeg.pdb'; vinculando objeto quando quando sem nenhuma informaþÒo de depuraþÒo
57>jpeg.lib(jdcoefct.obj) : warning LNK4099: PDB 'jpeg.pdb' nÒo foi encontrado 'jpeg.lib(jdcoefct.obj)' ou no 'C:UsersAFCM_sourcereposOpenSceneGraph-OpenSceneGraph-3.6.0OpenSceneGraph-OpenSceneGraph-3.6.0buildbinosgPlugins-3.6.0jpeg.pdb'; vinculando objeto quando quando sem nenhuma informaþÒo de depuraþÒo
57>jpeg.lib(jdcolor.obj) : warning LNK4099: PDB 'jpeg.pdb' nÒo foi encontrado 'jpeg.lib(jdcolor.obj)' ou no 'C:UsersAFCM_sourcereposOpenSceneGraph-OpenSceneGraph-3.6.0OpenSceneGraph-OpenSceneGraph-3.6.0buildbinosgPlugins-3.6.0jpeg.pdb'; vinculando objeto quando quando sem nenhuma informaþÒo de depuraþÒo
57>jpeg.lib(jdmainct.obj) : warning LNK4099: PDB 'jpeg.pdb' nÒo foi encontrado 'jpeg.lib(jdmainct.obj)' ou no 'C:UsersAFCM_sourcereposOpenSceneGraph-OpenSceneGraph-3.6.0OpenSceneGraph-OpenSceneGraph-3.6.0buildbinosgPlugins-3.6.0jpeg.pdb'; vinculando objeto quando quando sem nenhuma informaþÒo de depuraþÒo
57>jpeg.lib(jddctmgr.obj) : warning LNK4099: PDB 'jpeg.pdb' nÒo foi encontrado 'jpeg.lib(jddctmgr.obj)' ou no 'C:UsersAFCM_sourcereposOpenSceneGraph-OpenSceneGraph-3.6.0OpenSceneGraph-OpenSceneGraph-3.6.0buildbinosgPlugins-3.6.0jpeg.pdb'; vinculando objeto quando quando sem nenhuma informaþÒo de depuraþÒo
57>jpeg.lib(jdpostct.obj) : warning LNK4099: PDB 'jpeg.pdb' nÒo foi encontrado 'jpeg.lib(jdpostct.obj)' ou no 'C:UsersAFCM_sourcereposOpenSceneGraph-OpenSceneGraph-3.6.0OpenSceneGraph-OpenSceneGraph-3.6.0buildbinosgPlugins-3.6.0jpeg.pdb'; vinculando objeto quando quando sem nenhuma informaþÒo de depuraþÒo
57>jpeg.lib(jaricom.obj) : warning LNK4099: PDB 'jpeg.pdb' nÒo foi encontrado 'jpeg.lib(jaricom.obj)' ou no 'C:UsersAFCM_sourcereposOpenSceneGraph-OpenSceneGraph-3.6.0OpenSceneGraph-OpenSceneGraph-3.6.0buildbinosgPlugins-3.6.0jpeg.pdb'; vinculando objeto quando quando sem nenhuma informaþÒo de depuraþÒo
57>jpeg.lib(jfdctint.obj) : warning LNK4099: PDB 'jpeg.pdb' nÒo foi encontrado 'jpeg.lib(jfdctint.obj)' ou no 'C:UsersAFCM_sourcereposOpenSceneGraph-OpenSceneGraph-3.6.0OpenSceneGraph-OpenSceneGraph-3.6.0buildbinosgPlugins-3.6.0jpeg.pdb'; vinculando objeto quando quando sem nenhuma informaþÒo de depuraþÒo
57>jpeg.lib(jfdctfst.obj) : warning LNK4099: PDB 'jpeg.pdb' nÒo foi encontrado 'jpeg.lib(jfdctfst.obj)' ou no 'C:UsersAFCM_sourcereposOpenSceneGraph-OpenSceneGraph-3.6.0OpenSceneGraph-OpenSceneGraph-3.6.0buildbinosgPlugins-3.6.0jpeg.pdb'; vinculando objeto quando quando sem nenhuma informaþÒo de depuraþÒo
57>jpeg.lib(jfdctflt.obj) : warning LNK4099: PDB 'jpeg.pdb' nÒo foi encontrado 'jpeg.lib(jfdctflt.obj)' ou no 'C:UsersAFCM_sourcereposOpenSceneGraph-OpenSceneGraph-3.6.0OpenSceneGraph-OpenSceneGraph-3.6.0buildbinosgPlugins-3.6.0jpeg.pdb'; vinculando objeto quando quando sem nenhuma informaþÒo de depuraþÒo
57>jpeg.lib(jidctint.obj) : warning LNK4099: PDB 'jpeg.pdb' nÒo foi encontrado 'jpeg.lib(jidctint.obj)' ou no 'C:UsersAFCM_sourcereposOpenSceneGraph-OpenSceneGraph-3.6.0OpenSceneGraph-OpenSceneGraph-3.6.0buildbinosgPlugins-3.6.0jpeg.pdb'; vinculando objeto quando quando sem nenhuma informaþÒo de depuraþÒo
57>jpeg.lib(jidctfst.obj) : warning LNK4099: PDB 'jpeg.pdb' nÒo foi encontrado 'jpeg.lib(jidctfst.obj)' ou no 'C:UsersAFCM_sourcereposOpenSceneGraph-OpenSceneGraph-3.6.0OpenSceneGraph-OpenSceneGraph-3.6.0buildbinosgPlugins-3.6.0jpeg.pdb'; vinculando objeto quando quando sem nenhuma informaþÒo de depuraþÒo
57>jpeg.lib(jidctflt.obj) : warning LNK4099: PDB 'jpeg.pdb' nÒo foi encontrado 'jpeg.lib(jidctflt.obj)' ou no 'C:UsersAFCM_sourcereposOpenSceneGraph-OpenSceneGraph-3.6.0OpenSceneGraph-OpenSceneGraph-3.6.0buildbinosgPlugins-3.6.0jpeg.pdb'; vinculando objeto quando quando sem nenhuma informaþÒo de depuraþÒo
71>osgdb_osg.vcxproj -> C:UsersAFCM_sourcereposOpenSceneGraph-OpenSceneGraph-3.6.0OpenSceneGraph-OpenSceneGraph-3.6.0buildbinosgPlugins-3.6.0osgdb_osgd.dll
73>------ Compilação iniciada: Projeto: Plugins osgjs, Configuração: Debug x64 ------
57>osgdb_jpeg.vcxproj -> C:UsersAFCM_sourcereposOpenSceneGraph-OpenSceneGraph-3.6.0OpenSceneGraph-OpenSceneGraph-3.6.0buildbinosgPlugins-3.6.0osgdb_jpegd.dll
57>Projeto de compilação pronto "osgdb_jpeg.vcxproj".
74>------ Compilação iniciada: Projeto: Plugins osgshadow, Configuração: Debug x64 ------
51>Gerando Código...
72>osgdb_osga.vcxproj -> C:UsersAFCM_sourcereposOpenSceneGraph-OpenSceneGraph-3.6.0OpenSceneGraph-OpenSceneGraph-3.6.0buildbinosgPlugins-3.6.0osgdb_osgad.dll
75>------ Compilação iniciada: Projeto: Plugins osgterrain, Configuração: Debug x64 ------
74>osgdb_osgshadow.vcxproj -> C:UsersAFCM_sourcereposOpenSceneGraph-OpenSceneGraph-3.6.0OpenSceneGraph-OpenSceneGraph-3.6.0buildbinosgPlugins-3.6.0osgdb_osgshadowd.dll
76>------ Compilação iniciada: Projeto: Plugins osgtgz, Configuração: Debug x64 ------
73>osgdb_osgjs.vcxproj -> C:UsersAFCM_sourcereposOpenSceneGraph-OpenSceneGraph-3.6.0OpenSceneGraph-OpenSceneGraph-3.6.0buildbinosgPlugins-3.6.0osgdb_osgjsd.dll
77>------ Compilação iniciada: Projeto: Plugins osgviewer, Configuração: Debug x64 ------
75>osgdb_osgterrain.vcxproj -> C:UsersAFCM_sourcereposOpenSceneGraph-OpenSceneGraph-3.6.0OpenSceneGraph-OpenSceneGraph-3.6.0buildbinosgPlugins-3.6.0osgdb_osgterraind.dll
78>------ Compilação iniciada: Projeto: Plugins p3d, Configuração: Debug x64 ------
66>osgdb_nvtt.vcxproj -> C:UsersAFCM_sourcereposOpenSceneGraph-OpenSceneGraph-3.6.0OpenSceneGraph-OpenSceneGraph-3.6.0buildbinosgPlugins-3.6.0osgdb_nvttd.dll
79>------ Compilação iniciada: Projeto: Plugins pic, Configuração: Debug x64 ------
76>osgdb_osgtgz.vcxproj -> C:UsersAFCM_sourcereposOpenSceneGraph-OpenSceneGraph-3.6.0OpenSceneGraph-OpenSceneGraph-3.6.0buildbinosgPlugins-3.6.0osgdb_osgtgzd.dll
80>------ Compilação iniciada: Projeto: Plugins ply, Configuração: Debug x64 ------
77>osgdb_osgviewer.vcxproj -> C:UsersAFCM_sourcereposOpenSceneGraph-OpenSceneGraph-3.6.0OpenSceneGraph-OpenSceneGraph-3.6.0buildbinosgPlugins-3.6.0osgdb_osgviewerd.dll
81>------ Compilação iniciada: Projeto: Plugins png, Configuração: Debug x64 ------
81>Building Custom Rule C:/Users/AFCM_/source/repos/OpenSceneGraph-OpenSceneGraph-3.6.0/OpenSceneGraph-OpenSceneGraph-3.6.0/src/osgPlugins/png/CMakeLists.txt
81>CMake does not need to re-run because C:/Users/AFCM_/source/repos/OpenSceneGraph-OpenSceneGraph-3.6.0/OpenSceneGraph-OpenSceneGraph-3.6.0/build/src/osgPlugins/png/CMakeFiles/generate.stamp is up-to-date.
51>   Criando biblioteca C:/Users/AFCM_/source/repos/OpenSceneGraph-OpenSceneGraph-3.6.0/OpenSceneGraph-OpenSceneGraph-3.6.0/build/lib/osgPlugins-3.6.0/osgdb_gdald.lib e objeto C:/Users/AFCM_/source/repos/OpenSceneGraph-OpenSceneGraph-3.6.0/OpenSceneGraph-OpenSceneGraph-3.6.0/build/lib/osgPlugins-3.6.0/osgdb_gdald.exp
81>ReaderWriterPNG.cpp
56>AnimationPath.cpp
79>osgdb_pic.vcxproj -> C:UsersAFCM_sourcereposOpenSceneGraph-OpenSceneGraph-3.6.0OpenSceneGraph-OpenSceneGraph-3.6.0buildbinosgPlugins-3.6.0osgdb_picd.dll
78>osgdb_p3d.vcxproj -> C:UsersAFCM_sourcereposOpenSceneGraph-OpenSceneGraph-3.6.0OpenSceneGraph-OpenSceneGraph-3.6.0buildbinosgPlugins-3.6.0osgdb_p3dd.dll
82>------ Compilação iniciada: Projeto: Plugins pnm, Configuração: Debug x64 ------
83>------ Compilação iniciada: Projeto: Plugins pov, Configuração: Debug x64 ------
80>osgdb_ply.vcxproj -> C:UsersAFCM_sourcereposOpenSceneGraph-OpenSceneGraph-3.6.0OpenSceneGraph-OpenSceneGraph-3.6.0buildbinosgPlugins-3.6.0osgdb_plyd.dll
84>------ Compilação iniciada: Projeto: Plugins pvr, Configuração: Debug x64 ------
51>osgdb_gdal.vcxproj -> C:UsersAFCM_sourcereposOpenSceneGraph-OpenSceneGraph-3.6.0OpenSceneGraph-OpenSceneGraph-3.6.0buildbinosgPlugins-3.6.0osgdb_gdald.dll
85>------ Compilação iniciada: Projeto: Plugins revisions, Configuração: Debug x64 ------
82>osgdb_pnm.vcxproj -> C:UsersAFCM_sourcereposOpenSceneGraph-OpenSceneGraph-3.6.0OpenSceneGraph-OpenSceneGraph-3.6.0buildbinosgPlugins-3.6.0osgdb_pnmd.dll
84>osgdb_pvr.vcxproj -> C:UsersAFCM_sourcereposOpenSceneGraph-OpenSceneGraph-3.6.0OpenSceneGraph-OpenSceneGraph-3.6.0buildbinosgPlugins-3.6.0osgdb_pvrd.dll
86>------ Compilação iniciada: Projeto: Plugins rgb, Configuração: Debug x64 ------
87>------ Compilação iniciada: Projeto: Plugins rot, Configuração: Debug x64 ------
85>osgdb_revisions.vcxproj -> C:UsersAFCM_sourcereposOpenSceneGraph-OpenSceneGraph-3.6.0OpenSceneGraph-OpenSceneGraph-3.6.0buildbinosgPlugins-3.6.0osgdb_revisionsd.dll
88>------ Compilação iniciada: Projeto: Plugins scale, Configuração: Debug x64 ------
89>------ Compilação iniciada: Projeto: Plugins osg serializer osg, Configuração: Debug x64 ------
90>------ Compilação iniciada: Projeto: Plugins osg serializer osganimation, Configuração: Debug x64 ------
90>C:Program Files (x86)Microsoft Visual Studio2017CommunityCommon7IDEVCVCTargetsMicrosoft.CppBuild.targets(321,5): error MSB3491: Não foi possível gravar linhas no arquivo "osgdb_serializers_osganimation.dirDebugPlugins .BC34A2F6.tlogPlugins osg serializer osganimation.lastbuildstate". O caminho e nome de ficheiro especificados, ou ambos, são demasiado grandes. O nome de ficheiro totalmente qualificado tem de ser inferior a 260 caracteres e o nome do directório tem de ser inferior a 248 caracteres.
90>Projeto de compilação pronto "osgdb_serializers_osganimation.vcxproj" -- FALHA.
91>------ Compilação iniciada: Projeto: Plugins osg serializer osgfx, Configuração: Debug x64 ------
86>osgdb_rgb.vcxproj -> C:UsersAFCM_sourcereposOpenSceneGraph-OpenSceneGraph-3.6.0OpenSceneGraph-OpenSceneGraph-3.6.0buildbinosgPlugins-3.6.0osgdb_rgbd.dll
92>------ Compilação iniciada: Projeto: Plugins osg serializer osgga, Configuração: Debug x64 ------
87>osgdb_rot.vcxproj -> C:UsersAFCM_sourcereposOpenSceneGraph-OpenSceneGraph-3.6.0OpenSceneGraph-OpenSceneGraph-3.6.0buildbinosgPlugins-3.6.0osgdb_rotd.dll
93>------ Compilação iniciada: Projeto: Plugins osg serializer osgmanipulator, Configuração: Debug x64 ------
93>C:Program Files (x86)Microsoft Visual Studio2017CommunityCommon7IDEVCVCTargetsMicrosoft.CppBuild.targets(321,5): error MSB3491: Não foi possível gravar linhas no arquivo "osgdb_serializers_osgmanipulator.dirDebugPlugins .D2061F02.tlogPlugins osg serializer osgmanipulator.lastbuildstate". O caminho e nome de ficheiro especificados, ou ambos, são demasiado grandes. O nome de ficheiro totalmente qualificado tem de ser inferior a 260 caracteres e o nome do directório tem de ser inferior a 248 caracteres.
93>Projeto de compilação pronto "osgdb_serializers_osgmanipulator.vcxproj" -- FALHA.
88>osgdb_scale.vcxproj -> C:UsersAFCM_sourcereposOpenSceneGraph-OpenSceneGraph-3.6.0OpenSceneGraph-OpenSceneGraph-3.6.0buildbinosgPlugins-3.6.0osgdb_scaled.dll
94>------ Compilação iniciada: Projeto: Plugins osg serializer osgparticle, Configuração: Debug x64 ------
95>------ Compilação iniciada: Projeto: Plugins osg serializer osgshadow, Configuração: Debug x64 ------
91>osgdb_serializers_osgfx.vcxproj -> C:UsersAFCM_sourcereposOpenSceneGraph-OpenSceneGraph-3.6.0OpenSceneGraph-OpenSceneGraph-3.6.0buildbinosgPlugins-3.6.0osgdb_serializers_osgfxd.dll
96>------ Compilação iniciada: Projeto: Plugins osg serializer osgsim, Configuração: Debug x64 ------
92>osgdb_serializers_osgga.vcxproj -> C:UsersAFCM_sourcereposOpenSceneGraph-OpenSceneGraph-3.6.0OpenSceneGraph-OpenSceneGraph-3.6.0buildbinosgPlugins-3.6.0osgdb_serializers_osggad.dll
97>------ Compilação iniciada: Projeto: Plugins osg serializer osgterrain, Configuração: Debug x64 ------
95>osgdb_serializers_osgshadow.vcxproj -> C:UsersAFCM_sourcereposOpenSceneGraph-OpenSceneGraph-3.6.0OpenSceneGraph-OpenSceneGraph-3.6.0buildbinosgPlugins-3.6.0osgdb_serializers_osgshadowd.dll
98>------ Compilação iniciada: Projeto: Plugins osg serializer osgtext, Configuração: Debug x64 ------
96>osgdb_serializers_osgsim.vcxproj -> C:UsersAFCM_sourcereposOpenSceneGraph-OpenSceneGraph-3.6.0OpenSceneGraph-OpenSceneGraph-3.6.0buildbinosgPlugins-3.6.0osgdb_serializers_osgsimd.dll
99>------ Compilação iniciada: Projeto: Plugins osg serializer osgui, Configuração: Debug x64 ------
94>osgdb_serializers_osgparticle.vcxproj -> C:UsersAFCM_sourcereposOpenSceneGraph-OpenSceneGraph-3.6.0OpenSceneGraph-OpenSceneGraph-3.6.0buildbinosgPlugins-3.6.0osgdb_serializers_osgparticled.dll
97>osgdb_serializers_osgterrain.vcxproj -> C:UsersAFCM_sourcereposOpenSceneGraph-OpenSceneGraph-3.6.0OpenSceneGraph-OpenSceneGraph-3.6.0buildbinosgPlugins-3.6.0osgdb_serializers_osgterraind.dll
100>------ Compilação iniciada: Projeto: Plugins osg serializer osgutil, Configuração: Debug x64 ------
101>------ Compilação iniciada: Projeto: Plugins osg serializer osgviewer, Configuração: Debug x64 ------
102>------ Compilação iniciada: Projeto: Plugins osg serializer osgvolume, Configuração: Debug x64 ------
99>osgdb_serializers_osgui.vcxproj -> C:UsersAFCM_sourcereposOpenSceneGraph-OpenSceneGraph-3.6.0OpenSceneGraph-OpenSceneGraph-3.6.0buildbinosgPlugins-3.6.0osgdb_serializers_osguid.dll
103>------ Compilação iniciada: Projeto: Plugins shp, Configuração: Debug x64 ------
100>osgdb_serializers_osgutil.vcxproj -> C:UsersAFCM_sourcereposOpenSceneGraph-OpenSceneGraph-3.6.0OpenSceneGraph-OpenSceneGraph-3.6.0buildbinosgPlugins-3.6.0osgdb_serializers_osgutild.dll
104>------ Compilação iniciada: Projeto: Plugins stl, Configuração: Debug x64 ------
101>osgdb_serializers_osgviewer.vcxproj -> C:UsersAFCM_sourcereposOpenSceneGraph-OpenSceneGraph-3.6.0OpenSceneGraph-OpenSceneGraph-3.6.0buildbinosgPlugins-3.6.0osgdb_serializers_osgviewerd.dll
105>------ Compilação iniciada: Projeto: Plugins tf, Configuração: Debug x64 ------
106>------ Compilação iniciada: Projeto: Plugins tga, Configuração: Debug x64 ------
56>AnisotropicLighting.cpp
102>osgdb_serializers_osgvolume.vcxproj -> C:UsersAFCM_sourcereposOpenSceneGraph-OpenSceneGraph-3.6.0OpenSceneGraph-OpenSceneGraph-3.6.0buildbinosgPlugins-3.6.0osgdb_serializers_osgvolumed.dll
107>------ Compilação iniciada: Projeto: Plugins tgz, Configuração: Debug x64 ------
103>osgdb_shp.vcxproj -> C:UsersAFCM_sourcereposOpenSceneGraph-OpenSceneGraph-3.6.0OpenSceneGraph-OpenSceneGraph-3.6.0buildbinosgPlugins-3.6.0osgdb_shpd.dll
108>------ Compilação iniciada: Projeto: Plugins tiff, Configuração: Debug x64 ------
104>osgdb_stl.vcxproj -> C:UsersAFCM_sourcereposOpenSceneGraph-OpenSceneGraph-3.6.0OpenSceneGraph-OpenSceneGraph-3.6.0buildbinosgPlugins-3.6.0osgdb_stld.dll
81>osgdb_png.vcxproj -> C:UsersAFCM_sourcereposOpenSceneGraph-OpenSceneGraph-3.6.0OpenSceneGraph-OpenSceneGraph-3.6.0buildbinosgPlugins-3.6.0osgdb_pngd.dll
106>osgdb_tga.vcxproj -> C:UsersAFCM_sourcereposOpenSceneGraph-OpenSceneGraph-3.6.0OpenSceneGraph-OpenSceneGraph-3.6.0buildbinosgPlugins-3.6.0osgdb_tgad.dll
105>osgdb_tf.vcxproj -> C:UsersAFCM_sourcereposOpenSceneGraph-OpenSceneGraph-3.6.0OpenSceneGraph-OpenSceneGraph-3.6.0buildbinosgPlugins-3.6.0osgdb_tfd.dll
109>------ Compilação iniciada: Projeto: Plugins trans, Configuração: Debug x64 ------
108>Building Custom Rule C:/Users/AFCM_/source/repos/OpenSceneGraph-OpenSceneGraph-3.6.0/OpenSceneGraph-OpenSceneGraph-3.6.0/src/osgPlugins/tiff/CMakeLists.txt
108>CMake does not need to re-run because C:/Users/AFCM_/source/repos/OpenSceneGraph-OpenSceneGraph-3.6.0/OpenSceneGraph-OpenSceneGraph-3.6.0/build/src/osgPlugins/tiff/CMakeFiles/generate.stamp is up-to-date.
108>ReaderWriterTIFF.cpp
107>osgdb_tgz.vcxproj -> C:UsersAFCM_sourcereposOpenSceneGraph-OpenSceneGraph-3.6.0OpenSceneGraph-OpenSceneGraph-3.6.0buildbinosgPlugins-3.6.0osgdb_tgzd.dll
109>osgdb_trans.vcxproj -> C:UsersAFCM_sourcereposOpenSceneGraph-OpenSceneGraph-3.6.0OpenSceneGraph-OpenSceneGraph-3.6.0buildbinosgPlugins-3.6.0osgdb_transd.dll
56>AutoTransform.cpp
108>osgdb_tiff.vcxproj -> C:UsersAFCM_sourcereposOpenSceneGraph-OpenSceneGraph-3.6.0OpenSceneGraph-OpenSceneGraph-3.6.0buildbinosgPlugins-3.6.0osgdb_tiffd.dll
56>AzimElevationSector.cpp
56>AzimSector.cpp
56>Billboard.cpp
56>BlendColor.cpp
56>BlendEquation.cpp
56>BlendFunc.cpp
56>BlinkSequence.cpp
56>BumpMapping.cpp
56>Camera.cpp
56>CameraView.cpp
56>Cartoon.cpp
56>ClipNode.cpp
56>ClipPlane.cpp
56>ClusterCullingCallback.cpp
56>ColorMask.cpp
56>Gerando Código...
56>Compilando...
56>CompositeLayer.cpp
56>ConeSector.cpp
56>ConvexPlanarOccluder.cpp
56>ConvexPlanarPolygon.cpp
56>CoordinateSystemNode.cpp
56>CullFace.cpp
56>DataInputStream.cpp
56>DataOutputStream.cpp
56>Depth.cpp
56>DirectionalSector.cpp
56>DOFTransform.cpp
56>Drawable.cpp
56>DrawArrayLengths.cpp
56>DrawArrays.cpp
56>DrawElementsUByte.cpp
56>DrawElementsUInt.cpp
56>DrawElementsUShort.cpp
56>Effect.cpp
56>ElevationSector.cpp
56>EllipsoidModel.cpp
56>Gerando Código...
56>Compilando...
56>Exception.cpp
56>FadeText.cpp
56>Fog.cpp
56>FragmentProgram.cpp
56>FrontFace.cpp
56>Geode.cpp
56>Geometry.cpp
56>Group.cpp
56>HeightFieldLayer.cpp
56>Image.cpp
56>ImageLayer.cpp
56>ImageSequence.cpp
56>Impostor.cpp
56>Layer.cpp
56>Light.cpp
56>LightModel.cpp
56>LightPoint.cpp
56>LightPointNode.cpp
56>LightSource.cpp
56>LineStipple.cpp
56>Gerando Código...
56>Compilando...
56>LineWidth.cpp
56>Locator.cpp
56>LOD.cpp
56>Material.cpp
56>MatrixTransform.cpp
56>Multisample.cpp
56>MultiSwitch.cpp
56>MultiTextureControl.cpp
56>Node.cpp
56>Object.cpp
56>OccluderNode.cpp
56>OcclusionQueryNode.cpp
56>PagedLOD.cpp
56>Point.cpp
56>PointSprite.cpp
56>PolygonMode.cpp
56>PolygonOffset.cpp
56>PolygonStipple.cpp
56>PositionAttitudeTransform.cpp
56>PrimitiveSet.cpp
56>Gerando Código...
56>Compilando...
56>Program.cpp
56>ProxyNode.cpp
56>ReaderWriterIVE.cpp
56>Scissor.cpp
56>Scribe.cpp
56>Sequence.cpp
56>ShadeModel.cpp
56>Shader.cpp
56>ShapeAttributeList.cpp
56>Shape.cpp
56>ShapeDrawable.cpp
56>SpecularHighlights.cpp
56>StateSet.cpp
56>Stencil.cpp
56>StencilTwoSided.cpp
56>Switch.cpp
56>SwitchLayer.cpp
56>Terrain.cpp
56>TerrainTile.cpp
56>TexEnvCombine.cpp
56>Gerando Código...
56>Compilando...
56>TexEnv.cpp
56>TexGen.cpp
56>TexGenNode.cpp
56>TexMat.cpp
56>Text3D.cpp
56>Text.cpp
56>Texture1D.cpp
56>Texture2D.cpp
56>Texture2DArray.cpp
56>Texture3D.cpp
56>Texture.cpp
56>TextureCubeMap.cpp
56>TextureRectangle.cpp
56>Transform.cpp
56>Uniform.cpp
56>VertexProgram.cpp
56>Viewport.cpp
56>VisibilityGroup.cpp
56>VolumeCompositeLayer.cpp
56>VolumeCompositeProperty.cpp
56>Gerando Código...
56>Compilando...
56>VolumeSwitchProperty.cpp
56>VolumeScalarProperty.cpp
56>VolumeTransferFunctionProperty.cpp
56>VolumePropertyAdjustmentCallback.cpp
56>Volume.cpp
56>VolumeImageLayer.cpp
56>VolumeLayer.cpp
56>VolumeLocator.cpp
56>VolumeTile.cpp
56>Gerando Código...
17>osgdb_zip.vcxproj -> C:UsersAFCM_sourcereposOpenSceneGraph-OpenSceneGraph-3.6.0OpenSceneGraph-OpenSceneGraph-3.6.0buildbinosgPlugins-3.6.0osgdb_zipd.dll
56>osgdb_ive.vcxproj -> C:UsersAFCM_sourcereposOpenSceneGraph-OpenSceneGraph-3.6.0OpenSceneGraph-OpenSceneGraph-3.6.0buildbinosgPlugins-3.6.0osgdb_ived.dll
110>------ Compilação iniciada: Projeto: ALL_BUILD, Configuração: Debug x64 ------
========== Compilar: 105 com êxito, 5 com falha, 3 atualizados, 0 ignorados ==========



tl:dr

39>Projeto de compilação pronto "osgdb_deprecated_osganimation.vcxproj" -- FALHA.
40>Projeto de compilação pronto "osgdb_deprecated_osgparticle.vcxproj" -- FALHA.
43>Projeto de compilação pronto "osgdb_deprecated_osgterrain.vcxproj" -- FALHA.
90>Projeto de compilação pronto "osgdb_serializers_osganimation.vcxproj" -- FALHA.
93>Projeto de compilação pronto "osgdb_serializers_osgmanipulator.vcxproj" -- FALHA.
========== Compilar: 105 sucessfull, 5 failed, 3 updated, 0 ignored==========


Afterwards I just built INSTALL

Heres the result:

Code:

1>------ Compilação iniciada: Projeto: Plugins osg deprecated osganimation, Configuração: Debug x64 ------
2>------ Compilação iniciada: Projeto: Plugins osg deprecated osgparticle, Configuração: Debug x64 ------
3>------ Compilação iniciada: Projeto: Plugins osg deprecated osgterrain, Configuração: Debug x64 ------
1>C:Program Files (x86)Microsoft Visual Studio2017CommunityCommon7IDEVCVCTargetsMicrosoft.CppBuild.targets(321,5): error MSB3491: Não foi possível gravar linhas no arquivo "osgdb_deprecated_osganimation.dirDebugPlugins .C844942A.tlogPlugins osg deprecated osganimation.lastbuildstate". O caminho e nome de ficheiro especificados, ou ambos, são demasiado grandes. O nome de ficheiro totalmente qualificado tem de ser inferior a 260 caracteres e o nome do directório tem de ser inferior a 248 caracteres.
1>Projeto de compilação pronto "osgdb_deprecated_osganimation.vcxproj" -- F
Back to top
dedeu
Newbie


Joined: 19 Apr 2018
Posts: 2

PostPosted: Fri Apr 20, 2018 4:57 pm    Post subject:
Reply with quote

Thank you so much for your kind input Ravi and Laurens.
Thanks to you I managed to compile sucessfully release build of the source on VS2017 however, when testing the result I cant seem to compile my own project...


Project-Properties
x64
- General -> Character Set -> Use Multi-Byte Character Set
- C/C++ -> General -> Additional Include Directories -> "C:/OSGraph/build/include”
- C/C++ -> Code Generation -> Runtime Library -> Multi-threaded Debug DLL (/MD)
- C/C++ -> Language -> Enable Run-Time Type Info -> Yes (/GR)
- Linker -> General -> Additional Library Directories -> "C:/OSGraph/build/lib“
- Linker -> Input -> Additional Dependencies -> "osg.lib, osgAnimation.lib, osgDB.lib, osgFX.lib, osgGA.lib, osgManipulator.lib, osgParticle.lib, osgPresentation.lib, osgShadow.lib, osgSim.lib, osgTerrain.lib, osgText.lib, osgUI.lib, osgUtil.lib, osgViewer.lib, osgVolume.lib, osgWidget.lib, OpenThreads.lib“


the code:
Code:

#include osgViewer/Viewer //with square brackets around it

int main(int argc, char *argv[])
{
return 0;
}



The compilation result:
Code:

1>------ Compilação iniciada: Projeto: Project2, Configuração: Debug x64 ------
1>main.cpp
1>c:\program files (x86)\windows kits\10\include\10.0.16299.0\um\gl\gl.h(1157): error C2144: erro de sintaxe: 'void' deve ser precedido por ';'
1>c:\program files (x86)\windows kits\10\include\10.0.16299.0\um\gl\gl.h(1157): error C4430: faltando especificador de tipo - int assumido. Observação: C++ não suporta default-int
1>c:\program files (x86)\windows kits\10\include\10.0.16299.0\um\gl\gl.h(1158): error C2144: erro de sintaxe: 'void' deve ser precedido por ';'
1>c:\program files (x86)\windows kits\10\include\10.0.16299.0\um\gl\gl.h(1158): error C4430: faltando especificador de tipo - int assumido. Observação: C++ não suporta default-int
1>c:\program files (x86)\windows kits\10\include\10.0.16299.0\um\gl\gl.h(1158): error C2086: 'int WINGDIAPI': redefinição
1>c:\program files (x86)\windows kits\10\include\10.0.16299.0\um\gl\gl.h(1157): note: consulte a declaração de 'WINGDIAPI'
1>c:\program files (x86)\windows kits\10\include\10.0.16299.0\um\gl\gl.h(1159): error C4430: faltando especificador de tipo - int assumido. Observação: C++ não suporta default-int
1>c:\program files (x86)\windows kits\10\include\10.0.16299.0\um\gl\gl.h(1159): error C2086: 'int WINGDIAPI': redefinição
1>c:\program files (x86)\windows kits\10\include\10.0.16299.0\um\gl\gl.h(1157): note: consulte a declaração de 'WINGDIAPI'
1>c:\program files (x86)\windows kits\10\include\10.0.16299.0\um\gl\gl.h(1159): error C2146: erro de sintaxe: ';' ausente antes do identificador 'GLboolean'
1>c:\program files (x86)\windows kits\10\include\10.0.16299.0\um\gl\gl.h(1160): error C2144: erro de sintaxe: 'void' deve ser precedido por ';'
1>c:\program files (x86)\windows kits\10\include\10.0.16299.0\um\gl\gl.h(1160): error C4430: faltando especificador de tipo - int assumido. Observação: C++ não suporta default-int
1>c:\program files (x86)\windows kits\10\include\10.0.16299.0\um\gl\gl.h(1160): error C2086: 'int WINGDIAPI': redefinição
1>c:\program files (x86)\windows kits\10\include\10.0.16299.0\um\gl\gl.h(1157): note: consulte a declaração de 'WINGDIAPI'
1>c:\program files (x86)\windows kits\10\include\10.0.16299.0\um\gl\gl.h(1161): error C2144: erro de sintaxe: 'void' deve ser precedido por ';'
1>c:\program files (x86)\windows kits\10\include\10.0.16299.0\um\gl\gl.h(1161): error C4430: faltando especificador de tipo - int assumido. Observação: C++ não suporta default-int
1>c:\program files (x86)\windows kits\10\include\10.0.16299.0\um\gl\gl.h(1161): error C2086: 'int WINGDIAPI': redefinição
1>c:\program files (x86)\windows kits\10\include\10.0.16299.0\um\gl\gl.h(1157): note: consulte a declaração de 'WINGDIAPI'
1>c:\program files (x86)\windows kits\10\include\10.0.16299.0\um\gl\gl.h(1162): error C2144: erro de sintaxe: 'void' deve ser precedido por ';'
1>c:\program files (x86)\windows kits\10\include\10.0.16299.0\um\gl\gl.h(1162): error C4430: faltando especificador de tipo - int assumido. Observação: C++ não suporta default-int
1>c:\program files (x86)\windows kits\10\include\10.0.16299.0\um\gl\gl.h(1162): error C2086: 'int WINGDIAPI': redefinição
1>c:\program files (x86)\windows kits\10\include\10.0.16299.0\um\gl\gl.h(1157): note: consulte a declaração de 'WINGDIAPI'
1>c:\program files (x86)\windows kits\10\include\10.0.16299.0\um\gl\gl.h(1163): error C2144: erro de sintaxe: 'void' deve ser precedido por ';'
1>c:\program files (x86)\windows kits\10\include\10.0.16299.0\um\gl\gl.h(1163): error C4430: faltando especificador de tipo - int assumido. Observação: C++ não suporta default-int
1>c:\program files (x86)\windows kits\10\include\10.0.16299.0\um\gl\gl.h(1163): error C2086: 'int WINGDIAPI': redefinição
1>c:\program files (x86)\windows kits\10\include\10.0.16299.0\um\gl\gl.h(1157): note: consulte a declaração de 'WINGDIAPI'
1>c:\program files (x86)\windows kits\10\include\10.0.16299.0\um\gl\gl.h(1164): error C2144: erro de sintaxe: 'void' deve ser precedido por ';'
1>c:\program files (x86)\windows kits\10\include\10.0.16299.0\um\gl\gl.h(1164): error C4430: faltando especificador de tipo - int assumido. Observação: C++ não suporta default-int
1>c:\program files (x86)\windows kits\10\include\10.0.16299.0\um\gl\gl.h(1164): error C2086: 'int WINGDIAPI': redefinição
1>c:\program files (x86)\windows kits\10\include\10.0.16299.0\um\gl\gl.h(1157): note: consulte a declaração de 'WINGDIAPI'
1>c:\program files (x86)\windows kits\10\include\10.0.16299.0\um\gl\gl.h(1165): error C2144: erro de sintaxe: 'void' deve ser precedido por ';'
1>c:\program files (x86)\windows kits\10\include\10.0.16299.0\um\gl\gl.h(1165): error C4430: faltando especificador de tipo - int assumido. Observação: C++ não suporta default-int
1>c:\program files (x86)\windows kits\10\include\10.0.16299.0\um\gl\gl.h(1165): error C2086: 'int WINGDIAPI': redefinição
1>c:\program files (x86)\windows kits\10\include\10.0.16299.0\um\gl\gl.h(1157): note: consulte a declaração de 'WINGDIAPI'
1>c:\program files (x86)\windows kits\10\include\10.0.16299.0\um\gl\gl.h(1166): error C2144: erro de sintaxe: 'void' deve ser precedido por ';'
1>c:\program files (x86)\windows kits\10\include\10.0.16299.0\um\gl\gl.h(1166): error C4430: faltando especificador de tipo - int assumido. Observação: C++ não suporta default-int
1>c:\program files (x86)\windows kits\10\include\10.0.16299.0\um\gl\gl.h(1166): error C2086: 'int WINGDIAPI': redefinição
1>c:\program files (x86)\windows kits\10\include\10.0.16299.0\um\gl\gl.h(1157): note: consulte a declaração de 'WINGDIAPI'
1>c:\program files (x86)\windows kits\10\include\10.0.16299.0\um\gl\gl.h(1167): error C2144: erro de sintaxe: 'void' deve ser precedido por ';'
1>c:\program files (x86)\windows kits\10\include\10.0.16299.0\um\gl\gl.h(1167): error C4430: faltando especificador de tipo - int assumido. Observação: C++ não suporta default-int
1>c:\program files (x86)\windows kits\10\include\10.0.16299.0\um\gl\gl.h(1167): error C2086: 'int WINGDIAPI': redefinição
1>c:\program files (x86)\windows kits\10\include\10.0.16299.0\um\gl\gl.h(1157): note: consulte a declaração de 'WINGDIAPI'
1>c:\program files (x86)\windows kits\10\include\10.0.16299.0\um\gl\gl.h(1168): error C2144: erro de sintaxe: 'void' deve ser precedido por ';'
1>c:\program files (x86)\windows kits\10\include\10.0.16299.0\um\gl\gl.h(1168): error C4430: faltando especificador de tipo - int assumido. Observação: C++ não suporta default-int
1>c:\program files (x86)\windows kits\10\include\10.0.16299.0\um\gl\gl.h(1168): error C2086: 'int WINGDIAPI': redefinição
1>c:\program files (x86)\windows kits\10\include\10.0.16299.0\um\gl\gl.h(1157): note: consulte a declaração de 'WINGDIAPI'
1>c:\program files (x86)\windows kits\10\include\10.0.16299.0\um\gl\gl.h(1169): error C2144: erro de sintaxe: 'void' deve ser precedido por ';'
1>c:\program files (x86)\windows kits\10\include\10.0.16299.0\um\gl\gl.h(1169): error C4430: faltando especificador de tipo - int assumido. Observação: C++ não suporta default-int
1>c:\program files (x86)\windows kits\10\include\10.0.16299.0\um\gl\gl.h(1169): error C2086: 'int WINGDIAPI': redefinição
1>c:\program files (x86)\windows kits\10\include\10.0.16299.0\um\gl\gl.h(1157): note: consulte a declaração de 'WINGDIAPI'
1>c:\program files (x86)\windows kits\10\include\10.0.16299.0\um\gl\gl.h(1170): error C2144: erro de sintaxe: 'void' deve ser precedido por ';'
1>c:\program files (x86)\windows kits\10\include\10.0.16299.0\um\gl\gl.h(1170): error C4430: faltando especificador de tipo - int assumido. Observação: C++ não suporta default-int
1>c:\program files (x86)\windows kits\10\include\10.0.16299.0\um\gl\gl.h(1170): error C2086: 'int WINGDIAPI': redefinição
1>c:\program files (x86)\windows kits\10\include\10.0.16299.0\um\gl\gl.h(1157): note: consulte a declaração de 'WINGDIAPI'
1>c:\program files (x86)\windows kits\10\include\10.0.16299.0\um\gl\gl.h(1171): error C2144: erro de sintaxe: 'void' deve ser precedido por ';'
1>c:\program files (x86)\windows kits\10\include\10.0.16299.0\um\gl\gl.h(1171): error C4430: faltando especificador de tipo - int assumido. Observação: C++ não suporta default-int
1>c:\program files (x86)\windows kits\10\include\10.0.16299.0\um\gl\gl.h(1171): error C2086: 'int WINGDIAPI': redefinição
1>c:\program files (x86)\windows kits\10\include\10.0.16299.0\um\gl\gl.h(1157): note: consulte a declaração de 'WINGDIAPI'
1>c:\program files (x86)\windows kits\10\include\10.0.16299.0\um\gl\gl.h(1172): error C2144: erro de sintaxe: 'void' deve ser precedido por ';'
1>c:\program files (x86)\windows kits\10\include\10.0.16299.0\um\gl\gl.h(1172): error C4430: faltando especificador de tipo - int assumido. Observação: C++ não suporta default-int
1>c:\program files (x86)\windows kits\10\include\10.0.16299.0\um\gl\gl.h(1172): error C2086: 'int WINGDIAPI': redefinição
1>c:\program files (x86)\windows kits\10\include\10.0.16299.0\um\gl\gl.h(1157): note: consulte a declaração de 'WINGDIAPI'
1>c:\program files (x86)\windows kits\10\include\10.0.16299.0\um\gl\gl.h(1173): error C2144: erro de sintaxe: 'void' deve ser precedido por ';'
1>c:\program files (x86)\windows kits\10\include\10.0.16299.0\um\gl\gl.h(1173): error C4430: faltando especificador de tipo - int assumido. Observação: C++ não suporta default-int
1>c:\program files (x86)\windows kits\10\include\10.0.16299.0\um\gl\gl.h(1173): error C2086: 'int WINGDIAPI': redefinição
1>c:\program files (x86)\windows kits\10\include\10.0.16299.0\um\gl\gl.h(1157): note: consulte a declaração de 'WINGDIAPI'
1>c:\program files (x86)\windows kits\10\include\10.0.16299.0\um\gl\gl.h(1174): error C2144: erro de sintaxe: 'void' deve ser precedido por ';'
1>c:\program files (x86)\windows kits\10\include\10.0.16299.0\um\gl\gl.h(1174): error C4430: faltando especificador de tipo - int assumido. Observação: C++ não suporta default-int
1>c:\program files (x86)\windows kits\10\include\10.0.16299.0\um\gl\gl.h(1174): error C2086: 'int WINGDIAPI': redefinição
1>c:\program files (x86)\windows kits\10\include\10.0.16299.0\um\gl\gl.h(1157): note: consulte a declaração de 'WINGDIAPI'
1>c:\program files (x86)\windows kits\10\include\10.0.16299.0\um\gl\gl.h(1175): error C2144: erro de sintaxe: 'void' deve ser precedido por ';'
1>c:\program files (x86)\windows kits\10\include\10.0.16299.0\um\gl\gl.h(1175): error C4430: faltando especificador de tipo - int assumido. Observação: C++ não suporta default-int
1>c:\program files (x86)\windows kits\10\include\10.0.16299.0\um\gl\gl.h(1175): error C2086: 'int WINGDIAPI': redefinição
1>c:\program files (x86)\windows kits\10\include\10.0.16299.0\um\gl\gl.h(1157): note: consulte a declaração de 'WINGDIAPI'
1>c:\program files (x86)\windows kits\10\include\10.0.16299.0\um\gl\gl.h(1176): error C2144: erro de sintaxe: 'void' deve ser precedido por ';'
1>c:\program files (x86)\windows kits\10\include\10.0.16299.0\um\gl\gl.h(1176): error C4430: faltando especificador de tipo - int assumido. Observação: C++ não suporta default-int
1>c:\program files (x86)\windows kits\10\include\10.0.16299.0\um\gl\gl.h(1176): error C2086: 'int WINGDIAPI': redefinição
1>c:\program files (x86)\windows kits\10\include\10.0.16299.0\um\gl\gl.h(1157): note: consulte a declaração de 'WINGDIAPI'
1>c:\program files (x86)\windows kits\10\include\10.0.16299.0\um\gl\gl.h(1177): error C2144: erro de sintaxe: 'void' deve ser precedido por ';'
1>c:\program files (x86)\windows kits\10\include\10.0.16299.0\um\gl\gl.h(1177): error C4430: faltando especificador de tipo - int assumido. Observação: C++ não suporta default-int
1>c:\program files (x86)\windows kits\10\include\10.0.16299.0\um\gl\gl.h(1177): error C2086: 'int WINGDIAPI': redefinição
1>c:\program files (x86)\windows kits\10\include\10.0.16299.0\um\gl\gl.h(1157): note: consulte a declaração de 'WINGDIAPI'
1>c:\program files (x86)\windows kits\10\include\10.0.16299.0\um\gl\gl.h(1178): error C2144: erro de sintaxe: 'void' deve ser precedido por ';'
1>c:\program files (x86)\windows kits\10\include\10.0.16299.0\um\gl\gl.h(1178): error C4430: faltando especificador de tipo - int assumido. Observação: C++ não suporta default-int
1>c:\program files (x86)\windows kits\10\include\10.0.16299.0\um\gl\gl.h(1178): error C2086: 'int WINGDIAPI': redefinição
1>c:\program files (x86)\windows kits\10\include\10.0.16299.0\um\gl\gl.h(1157): note: consulte a declaração de 'WINGDIAPI'
1>c:\program files (x86)\windows kits\10\include\10.0.16299.0\um\gl\gl.h(1179): error C2144: erro de sintaxe: 'void' deve ser precedido por ';'
1>c:\program files (x86)\windows kits\10\include\10.0.16299.0\um\gl\gl.h(1179): error C4430: faltando especificador de tipo - int assumido. Observação: C++ não suporta default-int
1>c:\program files (x86)\windows kits\10\include\10.0.16299.0\um\gl\gl.h(1179): error C2086: 'int WINGDIAPI': redefinição
1>c:\program files (x86)\windows kits\10\include\10.0.16299.0\um\gl\gl.h(1157): note: consulte a declaração de 'WINGDIAPI'
1>c:\program files (x86)\windows kits\10\include\10.0.16299.0\um\gl\gl.h(1180): error C2144: erro de sintaxe: 'void' deve ser precedido por ';'
1>c:\program files (x86)\windows kits\10\include\10.0.16299.0\um\gl\gl.h(1180): error C4430: faltando especificador de tipo - int assumido. Observação: C++ não suporta default-int
1>c:\program files (x86)\windows kits\10\include\10.0.16299.0\um\gl\gl.h(1180): error C2086: 'int WINGDIAPI': redefinição
1>c:\program files (x86)\windows kits\10\include\10.0.16299.0\um\gl\gl.h(1157): note: consulte a declaração de 'WINGDIAPI'
1>c:\program files (x86)\windows kits\10\include\10.0.16299.0\um\gl\gl.h(1181): error C2144: erro de sintaxe: 'void' deve ser precedido por ';'
1>c:\program files (x86)\windows kits\10\include\10.0.16299.0\um\gl\gl.h(1181): error C4430: faltando especificador de tipo - int assumido. Observação: C++ não suporta default-int
1>c:\program files (x86)\windows kits\10\include\10.0.16299.0\um\gl\gl.h(1181): error C2086: 'int WINGDIAPI': redefinição
1>c:\program files (x86)\windows kits\10\include\10.0.16299.0\um\gl\gl.h(1157): note: consulte a declaração de 'WINGDIAPI'
1>c:\program files (x86)\windows kits\10\include\10.0.16299.0\um\gl\gl.h(1182): error C2144: erro de sintaxe: 'void' deve ser precedido por ';'
1>c:\program files (x86)\windows kits\10\include\10.0.16299.0\um\gl\gl.h(1182): error C4430: faltando especificador de tipo - int assumido. Observação: C++ não suporta default-int
1>c:\program files (x86)\windows kits\10\include\10.0.16299.0\um\gl\gl.h(1182): error C2086: 'int WINGDIAPI': redefinição
1>c:\program files (x86)\windows kits\10\include\10.0.16299.0\um\gl\gl.h(1157): note: consulte a declaração de 'WINGDIAPI'
1>c:\program files (x86)\windows kits\10\include\10.0.16299.0\um\gl\gl.h(1183): error C2144: erro de sintaxe: 'void' deve ser precedido por ';'
1>c:\program files (x86)\windows kits\10\include\10.0.16299.0\um\gl\gl.h(1183): error C4430: faltando especificador de tipo - int assumido. Observação: C++ não suporta default-int
1>c:\program files (x86)\windows kits\10\include\10.0.16299.0\um\gl\gl.h(1183): error C2086: 'int WINGDIAPI': redefinição
1>c:\program files (x86)\windows kits\10\include\10.0.16299.0\um\gl\gl.h(1157): note: consulte a declaração de 'WINGDIAPI'
1>c:\program files (x86)\windows kits\10\include\10.0.16299.0\um\gl\gl.h(1184): error C2144: erro de sintaxe: 'void' deve ser precedido por ';'
1>c:\program files (x86)\windows kits\10\include\10.0.16299.0\um\gl\gl.h(1184): error C4430: faltando especificador de tipo - int assumido. Observação: C++ não suporta default-int
1>c:\program files (x86)\windows kits\10\include\10.0.16299.0\um\gl\gl.h(1184): error C2086: 'int WINGDIAPI': redefinição
1>c:\program files (x86)\windows kits\10\include\10.0.16299.0\um\gl\gl.h(1157): note: consulte a declaração de 'WINGDIAPI'
1>c:\program files (x86)\windows kits\10\include\10.0.16299.0\um\gl\gl.h(1185): error C2144: erro de sintaxe: 'void' deve ser precedido por ';'
1>c:\program files (x86)\windows kits\10\include\10.0.16299.0\um\gl\gl.h(1185): error C4430: faltando especificador de tipo - int assumido. Observação: C++ não suporta default-int
1>c:\program files (x86)\windows kits\10\include\10.0.16299.0\um\gl\gl.h(1185): error C2086: 'int WINGDIAPI': redefinição
1>c:\program files (x86)\windows kits\10\include\10.0.16299.0\um\gl\gl.h(1157): note: consulte a declaração de 'WINGDIAPI'
1>c:\program files (x86)\windows kits\10\include\10.0.16299.0\um\gl\gl.h(1186): error C2144: erro de sintaxe: 'void' deve ser precedido por ';'
1>c:\program files (x86)\windows kits\10\include\10.0.16299.0\um\gl\gl.h(1186): error C4430: faltando especificador de tipo - int assumido. Observação: C++ não suporta default-int
1>c:\program files (x86)\windows kits\10\include\10.0.16299.0\um\gl\gl.h(1186): error C2086: 'int WINGDIAPI': redefinição
1>c:\program files (x86)\windows kits\10\include\10.0.16299.0\um\gl\gl.h(1157): note: consulte a declaração de 'WINGDIAPI'
1>c:\program files (x86)\windows kits\10\include\10.0.16299.0\um\gl\gl.h(1187): error C2144: erro de sintaxe: 'void' deve ser precedido por ';'
1>c:\program files (x86)\windows kits\10\include\10.0.16299.0\um\gl\gl.h(1187): error C4430: faltando especificador de tipo - int assumido. Observação: C++ não suporta default-int
1>c:\program files (x86)\windows kits\10\include\10.0.16299.0\um\gl\gl.h(1187): error C2086: 'int WINGDIAPI': redefinição
1>c:\program files (x86)\windows kits\10\include\10.0.16299.0\um\gl\gl.h(1157): note: consulte a declaração de 'WINGDIAPI'
1>c:\program files (x86)\windows kits\10\include\10.0.16299.0\um\gl\gl.h(1188): error C2144: erro de sintaxe: 'void' deve ser precedido por ';'
1>c:\program files (x86)\windows kits\10\include\10.0.16299.0\um\gl\gl.h(1188): error C4430: faltando especificador de tipo - int assumido. Observação: C++ não suporta default-int
1>c:\program files (x86)\windows kits\10\include\10.0.16299.0\um\gl\gl.h(1188): error C2086: 'int WINGDIAPI': redefinição
1>c:\program files (x86)\windows kits\10\include\10.0.16299.0\um\gl\gl.h(1157): note: consulte a declaração de 'WINGDIAPI'
1>c:\program files (x86)\windows kits\10\include\10.0.16299.0\um\gl\gl.h(1189): error C2144: erro de sintaxe: 'void' deve ser precedido por ';'
1>c:\program files (x86)\windows kits\10\include\10.0.16299.0\um\gl\gl.h(1189): error C4430: faltando especificador de tipo - int assumido. Observação: C++ não suporta default-int
1>c:\program files (x86)\windows kits\10\include\10.0.16299.0\um\gl\gl.h(1189): error C2086: 'int WINGDIAPI': redefinição
1>c:\program files (x86)\windows kits\10\include\10.0.16299.0\um\gl\gl.h(1157): note: consulte a declaração de 'WINGDIAPI'
1>c:\program files (x86)\windows kits\10\include\10.0.16299.0\um\gl\gl.h(1190): error C2144: erro de sintaxe: 'void' deve ser precedido por ';'
1>c:\program files (x86)\windows kits\10\include\10.0.16299.0\um\gl\gl.h(1190): error C4430: faltando especificador de tipo - int assumido. Observação: C++ não suporta default-int
1>c:\program files (x86)\windows kits\10\include\10.0.16299.0\um\gl\gl.h(1190): error C2086: 'int WINGDIAPI': redefinição
1>c:\program files (x86)\windows kits\10\include\10.0.16299.0\um\gl\gl.h(1157): note: consulte a declaração de 'WINGDIAPI'
1>c:\program files (x86)\windows kits\10\include\10.0.16299.0\um\gl\gl.h(1191): error C2144: erro de sintaxe: 'void' deve ser precedido por ';'
1>c:\program files (x86)\windows kits\10\include\10.0.16299.0\um\gl\gl.h(1191): error C4430: faltando especificador de tipo - int assumido. Observação: C++ não suporta default-int
1>c:\program files (x86)\windows kits\10\include\10.0.16299.0\um\gl\gl.h(1191): error C2086: 'int WINGDIAPI': redefinição
1>c:\program files (x86)\windows kits\10\include\10.0.16299.0\um\gl\gl.h(1157): note: consulte a declaração de 'WINGDIAPI'
1>c:\program files (x86)\windows kits\10\include\10.0.16299.0\um\gl\gl.h(1192): error C2144: erro de sintaxe: 'void' deve ser precedido por ';'
1>c:\program files (x86)\windows kits\10\include\10.0.16299.0\um\gl\gl.h(1192): error C4430: faltando especificador de tipo - int assumido. Observação: C++ não suporta default-int
1>c:\program files (x86)\windows kits\10\include\10.0.16299.0\um\gl\gl.h(1192): error C2086: 'int WINGDIAPI': redefinição
1>c:\program files (x86)\windows kits\10\include\10.0.16299.0\um\gl\gl.h(1157): note: consulte a declaração de 'WINGDIAPI'
1>c:\program files (x86)\windows kits\10\include\10.0.16299.0\um\gl\gl.h(1193): error C2144: erro de sintaxe: 'void' deve ser precedido por ';'
1>c:\program files (x86)\windows kits\10\include\10.0.16299.0\um\gl\gl.h(1193): error C4430: faltando especificador de tipo - int assumido. Observação: C++ não suporta default-int
1>c:\program files (x86)\windows kits\10\include\10.0.16299.0\um\gl\gl.h(1193): error C2086: 'int WINGDIAPI': redefinição
1>c:\program files (x86)\windows kits\10\include\10.0.16299.0\um\gl\gl.h(1157): note: consulte a declaração de 'WINGDIAPI'
1>c:\program files (x86)\windows kits\10\include\10.0.16299.0\um\gl\gl.h(1194): error C2144: erro de sintaxe: 'void' deve ser precedido por ';'
1>c:\program files (x86)\windows kits\10\include\10.0.16299.0\um\gl\gl.h(1194): error C4430: faltando especificador de tipo - int assumido. Observação: C++ não suporta default-int
1>c:\program files (x86)\windows kits\10\include\10.0.16299.0\um\gl\gl.h(1194): error C2086: 'int WINGDIAPI': redefinição
1>c:\program files (x86)\windows kits\10\include\10.0.16299.0\um\gl\gl.h(1157): note: consulte a declaração de 'WINGDIAPI'
1>c:\program files (x86)\windows kits\10\include\10.0.16299.0\um\gl\gl.h(1195): error C2144: erro de sintaxe: 'void' deve ser precedido por ';'
1>c:\program files (x86)\windows kits\10\include\10.0.16299.0\um\gl\gl.h(1195): error C4430: faltando especificador de tipo - int assumido. Observação: C++ não suporta default-int
1>c:\program files (x86)\windows kits\10\include\10.0.16299.0\um\gl\gl.h(1195): error C2086: 'int WINGDIAPI': redefinição
1>c:\program files (x86)\windows kits\10\include\10.0.16299.0\um\gl\gl.h(1157): note: consulte a declaração de 'WINGDIAPI'
1>c:\program files (x86)\windows kits\10\include\10.0.16299.0\um\gl\gl.h(1196): error C2144: erro de sintaxe: 'void' deve ser precedido por ';'
1>c:\program files (x86)\windows kits\10\include\10.0.16299.0\um\gl\gl.h(1196): error C4430: faltando especificador de tipo - int assumido. Observação: C++ não suporta default-int
1>c:\program files (x86)\windows kits\10\include\10.0.16299.0\um\gl\gl.h(1196): error C2086: 'int WINGDIAPI': redefinição
1>c:\program files (x86)\windows kits\10\include\10.0.16299.0\um\gl\gl.h(1157): note: consulte a declaração de 'WINGDIAPI'
1>c:\program files (x86)\windows kits\10\include\10.0.16299.0\um\gl\gl.h(1197): error C2144: erro de sintaxe: 'void' deve ser precedido por ';'
1>c:\program files (x86)\windows kits\10\include\10.0.16299.0\um\gl\gl.h(1197): error C4430: faltando especificador de tipo - int assumido. Observação: C++ não suporta default-int
1>c:\program files (x86)\windows kits\10\include\10.0.16299.0\um\gl\gl.h(1197): error C2086: 'int WINGDIAPI': redefinição
1>c:\program files (x86)\windows kits\10\include\10.0.16299.0\um\gl\gl.h(1157): note: consulte a declaração de 'WINGDIAPI'
1>c:\program files (x86)\windows kits\10\include\10.0.16299.0\um\gl\gl.h(1198): error C2144: erro de sintaxe: 'void' deve ser precedido por ';'
1>c:\program files (x86)\windows kits\10\include\10.0.16299.0\um\gl\gl.h(1198): error C4430: faltando especificador de tipo - int assumido. Observação: C++ não suporta default-int
1>c:\program files (x86)\windows kits\10\include\10.0.16299.0\um\gl\gl.h(1198): error C2086: 'int WINGDIAPI': redefinição
1>c:\program files (x86)\windows kits\10\include\10.0.16299.0\um\gl\gl.h(1157): note: consulte a declaração de 'WINGDIAPI'
1>c:\program files (x86)\windows kits\10\include\10.0.16299.0\um\gl\gl.h(1199): error C2144: erro de sintaxe: 'void' deve ser precedido por ';'
1>c:\program files (x86)\windows kits\10\include\10.0.16299.0\um\gl\gl.h(1199): error C4430: faltando especificador de tipo - int assumido. Observação: C++ não suporta default-int
1>c:\program files (x86)\windows kits\10\include\10.0.16299.0\um\gl\gl.h(1199): error C2086: 'int WINGDIAPI': redefinição
1>c:\program files (x86)\windows kits\10\include\10.0.16299.0\um\gl\gl.h(1157): note: consulte a declaração de 'WINGDIAPI'
1>c:\program files (x86)\windows kits\10\include\10.0.16299.0\um\gl\gl.h(1200): error C2144: erro de sintaxe: 'void' deve ser precedido por ';'
1>c:\program files (x86)\windows kits\10\include\10.0.16299.0\um\gl\gl.h(1200): error C4430: faltando especificador de tipo - int assumido. Observação: C++ não suporta default-int
1>c:\program files (x86)\windows kits\10\include\10.0.16299.0\um\gl\gl.h(1200): error C2086: 'int WINGDIAPI': redefinição
1>c:\program files (x86)\windows kits\10\include\10.0.16299.0\um\gl\gl.h(1157): note: consulte a declaração de 'WINGDIAPI'
1>c:\program files (x86)\windows kits\10\include\10.0.16299.0\um\gl\gl.h(1201): error C2144: erro de sintaxe: 'void' deve ser precedido por ';'
1>c:\program files (x86)\windows kits\10\include\10.0.16299.0\um\gl\gl.h(1201): error C4430: faltando especificador de tipo - int assumido. Observação: C++ não suporta default-int
1>c:\program files (x86)\windows kits\10\include\10.0.16299.0\um\gl\gl.h(1201): error C2086: 'int WINGDIAPI': redefinição
1>c:\program files (x86)\windows kits\10\include\10.0.16299.0\um\gl\gl.h(1157): note: consulte a declaração de 'WINGDIAPI'
1>c:\program files (x86)\windows kits\10\include\10.0.16299.0\um\gl\gl.h(1202): error C2144: erro de sintaxe: 'void' deve ser precedido por ';'
1>c:\program files (x86)\windows kits\10\include\10.0.16299.0\um\gl\gl.h(1202): error C4430: faltando especificador de tipo - int assumido. Observação: C++ não suporta default-int
1>c:\program files (x86)\windows kits\10\include\10.0.16299.0\um\gl\gl.h(1202): error C2086: 'int WINGDIAPI': redefinição
1>c:\program files (x86)\windows kits\10\include\10.0.16299.0\um\gl\gl.h(1157): note: consulte a declaração de 'WINGDIAPI'
1>c:\program files (x86)\windows kits\10\include\10.0.16299.0\um\gl\gl.h(1203): error C2144: erro de sintaxe: 'void' deve ser precedido por ';'
1>c:\program files (x86)\windows kits\10\include\10.0.16299.0\um\gl\gl.h(1203): error C4430: faltando especificador de tipo - int assumido. Observação: C++ não suporta default-int
1>c:\program files (x86)\windows kits\10\include\10.0.16299.0\um\gl\gl.h(1203): error C2086: 'int WINGDIAPI': redefinição
1>c:\program files (x86)\windows kits\10\include\10.0.16299.0\um\gl\gl.h(1157): note: consulte a declaração de 'WINGDIAPI'
1>c:\program files (x86)\windows kits\10\include\10.0.16299.0\um\gl\gl.h(1204): error C2144: erro de sintaxe: 'void' deve ser precedido por ';'
1>c:\program files (x86)\windows kits\10\include\10.0.16299.0\um\gl\gl.h(1204): error C4430: faltando especificador de tipo - int assumido. Observação: C++ não suporta default-int
1>c:\program files (x86)\windows kits\10\include\10.0.16299.0\um\gl\gl.h(1204): error C2086: 'int WINGDIAPI': redefinição
1>c:\program files (x86)\windows kits\10\include\10.0.16299.0\um\gl\gl.h(1157): note: consulte a declaração de 'WINGDIAPI'
1>c:\program files (x86)\windows kits\10\include\10.0.16299.0\um\gl\gl.h(1205): error C2144: erro de sintaxe: 'void' deve ser precedido por ';'
1>c:\program files (x86)\windows kits\10\include\10.0.16299.0\um\gl\gl.h(1205): error C4430: faltando especificador de tipo - int assumido. Observação: C++ não suporta default-int
1>c:\program files (x86)\windows kits\10\include\10.0.16299.0\um\gl\gl.h(1205): error C2086: 'int WINGDIAPI': redefinição
1>c:\program files (x86)\windows kits\10\include\10.0.16299.0\um\gl\gl.h(1157): note: consulte a declaração de 'WINGDIAPI'
1>c:\program files (x86)\windows kits\10\include\10.0.16299.0\um\gl\gl.h(1206): error C2144: erro de sintaxe: 'void' deve ser precedido por ';'
1>c:\program files (x86)\windows kits\10\include\10.0.16299.0\um\gl\gl.h(1206): error C4430: faltando especificador de tipo - int assumido. Observação: C++ não suporta default-int
1>c:\program files (x86)\windows kits\10\include\10.0.16299.0\um\gl\gl.h(1206): error C2086: 'int WINGDIAPI': redefinição
1>c:\program files (x86)\windows kits\10\include\10.0.16299.0\um\gl\gl.h(1157): note: consulte a declaração de 'WINGDIAPI'
1>c:\program files (x86)\windows kits\10\include\10.0.16299.0\um\gl\gl.h(1207): error C2144: erro de sintaxe: 'void' deve ser precedido por ';'
1>c:\program files (x86)\windows kits\10\include\10.0.16299.0\um\gl\gl.h(1207): error C4430: faltando especificador de tipo - int assumido. Observação: C++ não suporta default-int
1>c:\program files (x86)\windows kits\10\include\10.0.16299.0\um\gl\gl.h(1207): error C2086: 'int WINGDIAPI': redefinição
1>c:\program files (x86)\windows kits\10\include\10.0.16299.0\um\gl\gl.h(1157): note: consulte a declaração de 'WINGDIAPI'
1>c:\program files (x86)\windows kits\10\include\10.0.16299.0\um\gl\gl.h(1207): fatal error C1003: contador de erros excede 100; interrompendo compilação
1>Projeto de compilação pronto "Project2.vcxproj" -- FALHA.
========== Compilar: 0 com êxito, 1 com falha, 0 atualizados, 0 ignorados ==========



Heres a part of my gl.h starting on line 1155


Code:

/*************************************************************/

/**ERRORS START HERE**/WINGDIAPI void APIENTRY glAccum (GLenum op, GLfloat value);
WINGDIAPI void APIENTRY glAlphaFunc (GLenum func, GLclampf ref);
WINGDIAPI GLboolean APIENTRY glAreTexturesResident (GLsizei n, const GLuint *textures, GLboolean *residences);
WINGDIAPI void APIENTRY glArrayElement (GLint i);
WINGDIAPI void APIENTRY glBegin (GLenum mode);
WINGDIAPI void APIENTRY glBindTexture (GLenum target, GLuint texture);
WINGDIAPI void APIENTRY glBitmap (GLsizei width, GLsizei height, GLfloat xorig, GLfloat yorig, GLfloat xmove, GLfloat ymove, const GLubyte *bitmap);
WINGDIAPI void APIENTRY glBlendFunc (GLenum sfactor, GLenum dfactor);
WINGDIAPI void APIENTRY glCallList (GLuint list);
WINGDIAPI void APIENTRY glCallLists (GLsizei n, GLenum type, const GLvoid *lists);


Has anyone come across this type of situatuion?
Back to top
View user's profile Send private message
Voerman, L.
Guest





PostPosted: Mon Apr 23, 2018 7:33 am    Post subject:
Building OpenSceneGraph-3.6.0 on Windows 10 with VS2017
Reply with quote

Hi André,

You seem to build your project without a definition of WIN32 - don't do that.
you say 
- C/C++ -> Code Generation -> Runtime Library -> Multi-threaded Debug DLL (/MD) 

that does not exist. The debug switch is /MDd, when linking to the release libs (osg.lib;osgDB.lib,etc) use  Multi-threaded DLL (/MD)  


You probably want to use CMake to generate your project file anyway, use the example CMakeLists.txt in "OpenSceneGraphexamplesosgCMakeExample" to get started.
Regards, Laurens.


On Fri, Apr 20, 2018 at 6:57 PM, André Martins < (
Only registered users can see emails on this board!
Get registred or enter the forums!
)> wrote:
Quote:
Thank you so much for your kind input Ravi and Laurens.
Thanks to you I managed to compile sucessfully release build of the source on VS2017 however, when testing the result I cant seem to compile my own project...


Project-Properties
x64
- General -> Character Set -> Use Multi-Byte Character Set
- C/C++ -> General -> Additional Include Directories -> "C:/OSGraph/build/include”
- C/C++ -> Code Generation -> Runtime Library -> Multi-threaded Debug DLL (/MD)
- C/C++ -> Language -> Enable Run-Time Type Info -> Yes (/GR)
- Linker -> General -> Additional Library Directories -> "C:/OSGraph/build/lib“
- Linker -> Input -> Additional Dependencies -> "osg.lib, osgAnimation.lib, osgDB.lib, osgFX.lib, osgGA.lib, osgManipulator.lib, osgParticle.lib, osgPresentation.lib, osgShadow.lib, osgSim.lib, osgTerrain.lib, osgText.lib, osgUI.lib, osgUtil.lib, osgViewer.lib, osgVolume.lib, osgWidget.lib, OpenThreads.lib“


the code:

Code:

#include osgViewer/Viewer //with square brackets around it

int main(int argc, char *argv[])
{
return 0;
}





The compilation result:

Code:

1>------ Compilação iniciada: Projeto: Project2, Configuração: Debug x64 ------
1>main.cpp
1>c:program files (x86)windows kits10include10.0.16299.0umglgl.h(1157): error C2144: erro de sintaxe: 'void' deve ser precedido por ';'
1>c:program files (x86)windows kits10include10.0.16299.0umglgl.h(1157): error C4430: faltando especificador de tipo - int assumido. Observação: C++ não suporta default-int
1>c:program files (x86)windows kits10include10.0.16299.0umglgl.h(1158): error C2144: erro de sintaxe: 'void' deve ser precedido por ';'
1>c:program files (x86)windows kits10include10.0.16299.0umglgl.h(1158): error C4430: faltando especificador de tipo - int assumido. Observação: C++ não suporta default-int
1>c:program files (x86)windows kits10include10.0.16299.0umglgl.h(1158): error C2086: 'int WINGDIAPI': redefinição
1>c:program files (x86)windows kits10include10.0.16299.0umglgl.h(1157): note: consulte a declaração de 'WINGDIAPI'
1>c:program files (x86)windows kits10include10.0.16299.0umglgl.h(1159): error C4430: faltando especificador de tipo - int assumido. Observação: C++ não suporta default-int
1>c:program files (x86)windows kits10include10.0.16299.0umglgl.h(1159): error C2086: 'int WINGDIAPI': redefinição
1>c:program files (x86)windows kits10include10.0.16299.0umglgl.h(1157): note: consulte a declaração de 'WINGDIAPI'
1>c:program files (x86)windows kits10include10.0.16299.0umglgl.h(1159): error C2146: erro de sintaxe: ';' ausente antes do identificador 'GLboolean'
1>c:program files (x86)windows kits10include10.0.16299.0umglgl.h(1160): error C2144: erro de sintaxe: 'void' deve ser precedido por ';'
1>c:program files (x86)windows kits10include10.0.16299.0umglgl.h(1160): error C4430: faltando especificador de tipo - int assumido. Observação: C++ não suporta default-int
1>c:program files (x86)windows kits10include10.0.16299.0umglgl.h(1160): error C2086: 'int WINGDIAPI': redefinição
1>c:program files (x86)windows kits10include10.0.16299.0umglgl.h(1157): note: consulte a declaração de 'WINGDIAPI'
1>c:program files (x86)windows kits10include10.0.16299.0umglgl.h(1161): error C2144: erro de sintaxe: 'void' deve ser precedido por ';'
1>c:program files (x86)windows kits10include10.0.16299.0umglgl.h(1161): error C4430: faltando especificador de tipo - int assumido. Observação: C++ não suporta default-int
1>c:program files (x86)windows kits10include10.0.16299.0umglgl.h(1161): error C2086: 'int WINGDIAPI': redefinição
1>c:program files (x86)windows kits10include10.0.16299.0umglgl.h(1157): note: consulte a declaração de 'WINGDIAPI'
1>c:program files (x86)windows kits10include10.0.16299.0umglgl.h(1162): error C2144: erro de sintaxe: 'void' deve ser precedido por ';'
1>c:program files (x86)windows kits10include10.0.16299.0umglgl.h(1162): error C4430: faltando especificador de tipo - int assumido. Observação: C++ não suporta default-int
1>c:program files (x86)windows kits10include10.0.16299.0umglgl.h(1162): error C2086: 'int WINGDIAPI': redefinição
1>c:program files (x86)windows kits10include10.0.16299.0umglgl.h(1157): note: consulte a declaração de 'WINGDIAPI'
1>c:program files (x86)windows kits10include10.0.16299.0umglgl.h(1163): error C2144: erro de sintaxe: 'void' deve ser precedido por ';'
1>c:program files (x86)windows kits10include10.0.16299.0umglgl.h(1163): error C4430: faltando especificador de tipo - int assumido. Observação: C++ não suporta default-int
1>c:program files (x86)windows kits10include10.0.16299.0umglgl.h(1163): error C2086: 'int WINGDIAPI': redefinição
1>c:program files (x86)windows kits10include10.0.16299.0umglgl.h(1157): note: consulte a declaração de 'WINGDIAPI'
1>c:program files (x86)windows kits10include10.0.16299.0umglgl.h(1164): error C2144: erro de sintaxe: 'void' deve ser precedido por ';'
1>c:program files (x86)windows kits10include10.0.16299.0umglgl.h(1164): error C4430: faltando especificador de tipo - int assumido. Observação: C++ não suporta default-int
1>c:program files (x86)windows kits10include10.0.16299.0umglgl.h(1164): error C2086: 'int WINGDIAPI': redefinição
1>c:program files (x86)windows kits10include10.0.16299.0umglgl.h(1157): note: consulte a declaração de 'WINGDIAPI'
1>c:program files (x86)windows kits10include10.0.16299.0umglgl.h(1165): error C2144: erro de sintaxe: 'void' deve ser precedido por ';'
1>c:program files (x86)windows kits10include10.0.16299.0umglgl.h(1165): error C4430: faltando especificador de tipo - int assumido. Observação: C++ não suporta default-int
1>c:program files (x86)windows kits10include10.0.16299.0umglgl.h(1165): error C2086: 'int WINGDIAPI': redefinição
1>c:program files (x86)windows kits10include10.0.16299.0umglgl.h(1157): note: consulte a declaração de 'WINGDIAPI'
1>c:program files (x86)windows kits10include10.0.16299.0umglgl.h(1166): error C2144: erro de sintaxe: 'void' deve ser precedido por ';'
1>c:program files (x86)windows kits10include10.0.16299.0umglgl.h(1166): error C4430: faltando especificador de tipo - int assumido. Observação: C++ não suporta default-int
1>c:program files (x86)windows kits10include10.0.16299.0umglgl.h(1166): error C2086: 'int WINGDIAPI': redefinição
1>c:program files (x86)windows kits10include10.0.16299.0umglgl.h(1157): note: consulte a declaração de 'WINGDIAPI'
1>c:program files (x86)windows kits10include10.0.16299.0umglgl.h(1167): error C2144: erro de sintaxe: 'void' deve ser precedido por ';'
1>c:program files (x86)windows kits10include10.0.16299.0umglgl.h(1167): error C4430: faltando especificador de tipo - int assumido. Observação: C++ não suporta default-int
1>c:program files (x86)windows kits10include10.0.16299.0umglgl.h(1167): error C2086: 'int WINGDIAPI': redefinição
1>c:program files (x86)windows kits10include10.0.16299.0umglgl.h(1157): note: consulte a declaração de 'WINGDIAPI'
1>c:program files (x86)windows kits10include10.0.16299.0umglgl.h(1168): error C2144: erro de sintaxe: 'void' deve ser precedido por ';'
1>c:program files (x86)windows kits10include10.0.16299.0umglgl.h(1168): error C4430: faltando especificador de tipo - int assumido. Observação: C++ não suporta default-int
1>c:program files (x86)windows kits10include10.0.16299.0umglgl.h(1168): error C2086: 'int WINGDIAPI': redefinição
1>c:program files (x86)windows kits10include10.0.16299.0umglgl.h(1157): note: consulte a declaração de 'WINGDIAPI'
1>c:program files (x86)windows kits10include10.0.16299.0umglgl.h(1169): error C2144: erro de sintaxe: 'void' deve ser precedido por ';'
1>c:program files (x86)windows kits10include10.0.16299.0umglgl.h(1169): error C4430: faltando especificador de tipo - int assumido. Observação: C++ não suporta default-int
1>c:program files (x86)windows kits10include10.0.16299.0umglgl.h(1169): error C2086: 'int WINGDIAPI': redefinição
1>c:program files (x86)windows kits10include10.0.16299.0umglgl.h(1157): note: consulte a declaração de 'WINGDIAPI'
1>c:program files (x86)windows kits10include10.0.16299.0umglgl.h(1170): error C2144: erro de sintaxe: 'void' deve ser precedido por ';'
1>c:program files (x86)windows kits10include10.0.16299.0umglgl.h(1170): error C4430: faltando especificador de tipo - int assumido. Observação: C++ não suporta default-int
1>c:program files (x86)windows kits10include10.0.16299.0umglgl.h(1170): error C2086: 'int WINGDIAPI': redefinição
1>c:program files (x86)windows kits10include10.0.16299.0umglgl.h(1157): note: consulte a declaração de 'WINGDIAPI'
1>c:program files (x86)windows kits10include10.0.16299.0umglgl.h(1171): error C2144: erro de sintaxe: 'void' deve ser precedido por ';'
1>c:program files (x86)windows kits10include10.0.16299.0umglgl.h(1171): error C4430: faltando especificador de tipo - int assumido. Observação: C++ não suporta default-int
1>c:program files (x86)windows kits10include10.0.16299.0umglgl.h(1171): error C2086: 'int WINGDIAPI': redefinição
1>c:program files (x86)windows kits10include10.0.16299.0umglgl.h(1157): note: consulte a declaração de 'WINGDIAPI'
1>c:program files (x86)windows kits10include10.0.16299.0umglgl.h(1172): error C2144: erro de sintaxe: 'void' deve ser precedido por ';'
1>c:program files (x86)windows kits10include10.0.16299.0umglgl.h(1172): error C4430: faltando especificador de tipo - int assumido. Observação: C++ não suporta default-int
1>c:program files (x86)windows kits10include10.0.16299.0umglgl.h(1172): error C2086: 'int WINGDIAPI': redefinição
1>c:program files (x86)windows kits10include10.0.16299.0umglgl.h(1157): note: consulte a declaração de 'WINGDIAPI'
1>c:program files (x86)windows kits10include10.0.16299.0umglgl.h(1173): error C2144: erro de sintaxe: 'void' deve ser precedido por ';'
1>c:program files (x86)windows kits10include10.0.16299.0umglgl.h(1173): error C4430: faltando especificador de tipo - int assumido. Observação: C++ não suporta default-int
1>c:program files (x86)windows kits10include10.0.16299.0umglgl.h(1173): error C2086: 'int WINGDIAPI': redefinição
1>c:program files (x86)windows kits10include10.0.16299.0umglgl.h(1157): note: consulte a declaração de 'WINGDIAPI'
1>c:program files (x86)windows kits10include10.0.16299.0umglgl.h(1174): error C2144: erro de sintaxe: 'void' deve ser precedido por ';'
1>c:program files (x86)windows kits10include10.0.16299.0umglgl.h(1174): error C4430: faltando especificador de tipo - int assumido. Observação: C++ não suporta default-int
1>c:program files (x86)windows kits10include10.0.16299.0umglgl.h(1174): error C2086: 'int WINGDIAPI': redefinição
1>c:program files (x86)windows kits10include10.0.16299.0umglgl.h(1157): note: consulte a declaração de 'WINGDIAPI'
1>c:program files (x86)windows kits10include10.0.16299.0umglgl.h(1175): error C2144: erro de sintaxe: 'void' deve ser precedido por ';'
1>c:program files (x86)windows kits10include10.0.16299.0umglgl.h(1175): error C4430: faltando especificador de tipo - int assumido. Observação: C++ não suporta default-int
1>c:program files (x86)windows kits10include10.0.16299.0umglgl.h(1175): error C2086: 'int WINGDIAPI': redefinição
1>c:program files (x86)windows kits10include10.0.16299.0umglgl.h(1157): note: consulte a declaração de 'WINGDIAPI'
1>c:program files (x86)windows kits10include10.0.16299.0umglgl.h(1176): error C2144: erro de sintaxe: 'void' deve ser precedido por ';'
1>c:program files (x86)windows kits10include10.0.16299.0umglgl.h(1176): error C4430: faltando especificador de tipo - int assumido. Observação: C++ não suporta default-int
1>c:program files (x86)windows kits10include10.0.16299.0umglgl.h(1176): error C2086: 'int WINGDIAPI': redefinição
1>c:program files (x86)windows kits10include10.0.16299.0umglgl.h(1157): note: consulte a declaração de 'WINGDIAPI'
1>c:program files (x86)windows kits10include10.0.16299.0umglgl.h(1177): error C2144: erro de sintaxe: 'void' deve ser precedido por ';'
1>c:program files (x86)windows kits10include10.0.16299.0umglgl.h(1177): error C4430: faltando especificador de tipo - int assumido. Observação: C++ não suporta default-int
1>c:program files (x86)windows kits10include10.0.16299.0umglgl.h(1177): error C2086: 'int WINGDIAPI': redefinição
1>c:program files (x86)windows kits10include10.0.16299.0umglgl.h(1157): note: consulte a declaração de 'WINGDIAPI'
1>c:program files (x86)windows kits10include10.0.16299.0umglgl.h(1178): error C2144: erro de sintaxe: 'void' deve ser precedido por ';'
1>c:program files (x86)windows kits10include10.0.16299.0umglgl.h(1178): error C4430: faltando especificador de tipo - int assumido. Observação: C++ não suporta default-int
1>c:program files (x86)windows kits10include10.0.16299.0umglgl.h(1178): error C2086: 'int WINGDIAPI': redefinição
1>c:program files (x86)windows kits10include10.0.16299.0umglgl.h(1157): note: consulte a declaração de 'WINGDIAPI'
1>c:program files (x86)windows kits10include10.0.16299.0umglgl.h(1179): error C2144: erro de sintaxe: 'void' deve ser precedido por ';'
1>c:program files (x86)windows kits10include10.0.16299.0umglgl.h(1179): error C4430: faltando especificador de tipo - int assumido. Observação: C++ não suporta default-int
1>c:program files (x86)windows kits10include10.0.16299.0umglgl.h(1179): error C2086: 'int WINGDIAPI': redefinição
1>c:program files (x86)windows kits10include10.0.16299.0umglgl.h(1157): note: consulte a declaração de 'WINGDIAPI'
1>c:program files (x86)windows kits10include10.0.16299.0umglgl.h(1180): error C2144: erro de sintaxe: 'void' deve ser precedido por ';'
1>c:program files (x86)windows kits10include10.0.16299.0umglgl.h(1180): error C4430: faltando especificador de tipo - int assumido. Observação: C++ não suporta default-int
1>c:program files (x86)windows kits10include10.0.16299.0umglgl.h(1180): error C2086: 'int WINGDIAPI': redefinição
1>c:program files (x86)windows kits10include10.0.16299.0umglgl.h(1157): note: consulte a declaração de 'WINGDIAPI'
1>c:program files (x86)windows kits10include10.0.16299.0umglgl.h(1181): error C2144: erro de sintaxe: 'void' deve ser precedido por ';'
1>c:program files (x86)windows kits10include10.0.16299.0umglgl.h(1181): error C4430: faltando especificador de tipo - int assumido. Observação: C++ não suporta default-int
1>c:program files (x86)windows kits10include10.0.16299.0umglgl.h(1181): error C2086: 'int WINGDIAPI': redefinição
1>c:program files (x86)windows kits10include10.0.16299.0umglgl.h(1157): note: consulte a declaração de 'WINGDIAPI'
1>c:program files (x86)windows kits10include10.0.16299.0umglgl.h(1182): error C2144: erro de sintaxe: 'void' deve ser precedido por ';'
1>c:program files (x86)windows kits10include10.0.16299.0umglgl.h(1182): error C4430: faltando especificador de tipo - int assumido. Observação: C++ não suporta default-int
1>c:program files (x86)windows kits10include10.0.16299.0umglgl.h(1182): error C2086: 'int WINGDIAPI': redefinição
1>c:program files (x86)windows kits10include10.0.16299.0umglgl.h(1157): note: consulte a declaração de 'WINGDIAPI'
1>c:program files (x86)windows kits10include10.0.16299.0umglgl.h(1183): error C2144: erro de sintaxe: 'void' deve ser precedido por ';'
1>c:program files (x86)windows kits10include10.0.16299.0umglgl.h(1183): error C4430: faltando especificador de tipo - int assumido. Observação: C++ não suporta default-int
1>c:program files (x86)windows kits10include10.0.16299.0umglgl.h(1183): error C2086: 'int WINGDIAPI': redefinição
1>c:program files (x86)windows kits10include10.0.16299.0umglgl.h(1157): note: consulte a declaração de 'WINGDIAPI'
1>c:program files (x86)windows kits10include10.0.16299.0umglgl.h(1184): error C2144: erro de sintaxe: 'void' deve ser precedido por ';'
1>c:program files (x86)windows kits10include10.0.16299.0umglgl.h(1184): error C4430: faltando especificador de tipo - int assumido. Observação: C++ não suporta default-int
1>c:program files (x86)windows kits10include10.0.16299.0umglgl.h(1184): error C2086: 'int WINGDIAPI': redefinição
1>c:program files (x86)windows kits10include10.0.16299.0umglgl.h(1157): note: consulte a declaração de 'WINGDIAPI'
1>c:program files (x86)windows kits10include10.0.16299.0umglgl.h(1185): error C2144: erro de sintaxe: 'void' deve ser precedido por ';'
1>c:program files (x86)windows kits10include10.0.16299.0umglgl.h(1185): error C4430: faltando especificador de tipo - int assumido. Observação: C++ não suporta default-int
1>c:program files (x86)windows kits10include10.0.16299.0umglgl.h(1185): error C2086: 'int WINGDIAPI': redefinição
1>c:program files (x86)windows kits10include10.0.16299.0umglgl.h(1157): note: consulte a declaração de 'WINGDIAPI'
1>c:program files (x86)windows kits10include10.0.16299.0umglgl.h(1186): error C2144: erro de sintaxe: 'void' deve ser precedido por ';'
1>c:program files (x86)windows kits10include10.0.16299.0umglgl.h(1186): error C4430: faltando especificador de tipo - int assumido. Observação: C++ não suporta default-int
1>c:program files (x86)windows kits10include10.0.16299.0umglgl.h(1186): error C2086: 'int WINGDIAPI': redefinição
1>c:program files (x86)windows kits10include10.0.16299.0umglgl.h(1157): note: consulte a declaração de 'WINGDIAPI'
1>c:program files (x86)windows kits10include10.0.16299.0umglgl.h(1187): error C2144: erro de sintaxe: 'void' deve ser precedido por ';'
1>c:program files (x86)windows kits10include10.0.16299.0umglgl.h(1187): error C4430: faltando especificador de tipo - int assumido. Observação: C++ não suporta default-int
1>c:program files (x86)windows kits10include10.0.16299.0umglgl.h(1187): error C2086: 'int WINGDIAPI': redefinição
1>c:program files (x86)windows kits10include10.0.16299.0umglgl.h(1157): note: consulte a declaração de 'WINGDIAPI'
1>c:program files (x86)windows kits10include10.0.16299.0umglgl.h(1188): error C2144: erro de sintaxe: 'void' deve ser precedido por ';'
1>c:program files (x86)windows kits10include10.0.16299.0umglgl.h(1188): error C4430: faltando especificador de tipo - int assumido. Observação: C++ não suporta default-int
1>c:program files (x86)windows kits10include10.0.16299.0umglgl.h(1188): error C2086: 'int WINGDIAPI': redefinição
1>c:program files (x86)windows kits10include10.0.16299.0umglgl.h(1157): note: consulte a declaração de 'WINGDIAPI'
1>c:program files (x86)windows kits10include10.0.16299.0umglgl.h(1189): error C2144: erro de sintaxe: 'void' deve ser precedido por ';'
1>c:program files (x86)windows kits10include10.0.16299.0umglgl.h(1189): error C4430: faltando especificador de tipo - int assumido. Observação: C++ não suporta default-int
1>c:program files (x86)windows kits10include10.0.16299.0umglgl.h(1189): error C2086: 'int WINGDIAPI': redefinição
1>c:program files (x86)windows kits10include10.0.16299.0umglgl.h(1157): note: consulte a declaração de 'WINGDIAPI'
1>c:program files (x86)windows kits10include10.0.16299.0umglgl.h(1190): error C2144: erro de sintaxe: 'void' deve ser precedido por ';'
1>c:program files (x86)windows kits10include10.0.16299.0umglgl.h(1190): error C4430: faltando especificador de tipo - int assumido. Observação: C++ não suporta default-int
1>c:program files (x86)windows kits10include10.0.16299.0umglgl.h(1190): error C2086: 'int WINGDIAPI': redefinição
1>c:program files (x86)windows kits10include10.0.16299.0umglgl.h(1157): note: consulte a declaração de 'WINGDIAPI'
1>c:program files (x86)windows kits10include10.0.16299.0umglgl.h(1191): error C2144: erro de sintaxe: 'void' deve ser precedido por ';'
1>c:program files (x86)windows kits10include10.0.16299.0umglgl.h(1191): error C4430: faltando especificador de tipo - int assumido. Observação: C++ não suporta default-int
1>c:program files (x86)windows kits10include10.0.16299.0umglgl.h(1191): error C2086: 'int WINGDIAPI': redefinição
1>c:program files (x86)windows kits10include10.0.16299.0umglgl.h(1157): note: consulte a declaração de 'WINGDIAPI'
1>c:program files (x86)windows kits10include10.0.16299.0umglgl.h(1192): error C2144: erro de sintaxe: 'void' deve ser precedido por ';'
1>c:program files (x86)windows kits10include10.0.16299.0umglgl.h(1192): error C4430: faltando especificador de tipo - int assumido. Observação: C++ não suporta default-int
1>c:program files (x86)windows kits10include10.0.16299.0umglgl.h(1192): error C2086: 'int WINGDIAPI': redefinição
1>c:program files (x86)windows kits10include10.0.16299.0umglgl.h(1157): note: consulte a declaração de 'WINGDIAPI'
1>c:program files (x86)windows kits10include10.0.16299.0umglgl.h(1193): error C2144: erro de sintaxe: 'void' deve ser precedido por ';'
1>c:program files (x86)windows kits10include10.0.16299.0umglgl.h(1193): error C4430: faltando especificador de tipo - int assumido. Observação: C++ não suporta default-int
1>c:program files (x86)windows kits10include10.0.16299.0umglgl.h(1193): error C2086: 'int WINGDIAPI': redefinição
1>c:program files (x86)windows kits10include10.0.16299.0umglgl.h(1157): note: consulte a declaração de 'WINGDIAPI'
1>c:program files (x86)windows kits10include10.0.16299.0umglgl.h(1194): error C2144: erro de sintaxe: 'void' deve ser precedido por ';'
1>c:program files (x86)windows kits10include10.0.16299.0umglgl.h(1194): error C4430: faltando especificador de tipo - int assumido. Observação: C++ não suporta default-int
1>c:program files (x86)windows kits10include10.0.16299.0umglgl.h(1194): error C2086: 'int WINGDIAPI': redefinição
1>c:program files (x86)windows kits10include10.0.16299.0umglgl.h(1157): note: consulte a declaração de 'WINGDIAPI'
1>c:program files (x86)windows kits10include10.0.16299.0umglgl.h(1195): error C2144: erro de sintaxe: 'void' deve ser precedido por ';'
1>c:program files (x86)windows kits10include10.0.16299.0umglgl.h(1195): error C4430: faltando especificador de tipo - int assumido. Observação: C++ não suporta default-int
1>c:program files (x86)windows kits10include10.0.16299.0umglgl.h(1195): error C2086: 'int WINGDIAPI': redefinição
1>c:program files (x86)windows kits10include10.0.16299.0umglgl.h(1157): note: consulte a declaração de 'WINGDIAPI'
1>c:program files (x86)windows kits10include10.0.16299.0umglgl.h(1196): error C2144: erro de sintaxe: 'void' deve ser precedido por ';'
1>c:program files (x86)windows kits10include10.0.16299.0umglgl.h(1196): error C4430: faltando especificador de tipo - int assumido. Observação: C++ não suporta default-int
1>c:program files (x86)windows kits10include10.0.16299.0umglgl.h(1196): error C2086: 'int WINGDIAPI': redefinição
1>c:program files (x86)windows kits10include10.0.16299.0umglgl.h(1157): note: consulte a declaração de 'WINGDIAPI'
1>c:program files (x86)windows kits10include10.0.16299.0umglgl.h(1197): error C2144: erro de sintaxe: 'void' deve ser precedido por ';'
1>c:program files (x86)windows kits10include10.0.16299.0umglgl.h(1197): error C4430: faltando especificador de tipo - int assumido. Observação: C++ não suporta default-int
1>c:program files (x86)windows kits10include10.0.16299.0umglgl.h(1197): error C2086: 'int WINGDIAPI': redefinição
1>c:program files (x86)windows kits10include10.0.16299.0umglgl.h(1157): note: consulte a declaração de 'WINGDIAPI'
1>c:program files (x86)windows kits10include10.0.16299.0umglgl.h(1198): error C2144: erro de sintaxe: 'void' deve ser precedido por ';'
1>c:program files (x86)windows kits10include10.0.16299.0umglgl.h(1198): error C4430: faltando especificador de tipo - int assumido. Observação: C++ não suporta default-int
1>c:program files (x86)windows kits10include10.0.16299.0umglgl.h(1198): error C2086: 'int WINGDIAPI': redefinição
1>c:program files (x86)windows kits10include10.0.16299.0umglgl.h(1157): note: consulte a declaração de 'WINGDIAPI'
1>c:program files (x86)windows kits10include10.0.16299.0umglgl.h(1199): error C2144: erro de sintaxe: 'void' deve ser precedido por ';'
1>c:program files (x86)windows kits10include10.0.16299.0umglgl.h(1199): error C4430: faltando especificador de tipo - int assumido. Observação: C++ não suporta default-int
1>c:program files (x86)windows kits10include10.0.16299.0umglgl.h(1199): error C2086: 'int WINGDIAPI': redefinição
1>c:program files (x86)windows kits10include10.0.16299.0umglgl.h(1157): note: consulte a declaração de 'WINGDIAPI'
1>c:program files (x86)windows kits10include10.0.16299.0umglgl.h(1200): error C2144: erro de sintaxe: 'void' deve ser precedido por ';'
1>c:program files (x86)windows kits10include10.0.16299.0umglgl.h(1200): error C4430: faltando especificador de tipo - int assumido. Observação: C++ não suporta default-int
1>c:program files (x86)windows kits10include10.0.16299.0umglgl.h(1200): error C2086: 'int WINGDIAPI': redefinição
1>c:program files (x86)windows kits10include10.0.16299.0umglgl.h(1157): note: consulte a declaração de 'WINGDIAPI'
1>c:program files (x86)windows kits10include10.0.16299.0umglgl.h(1201): error C2144: erro de sintaxe: 'void' deve ser precedido por ';'
1>c:program files (x86)windows kits10include10.0.16299.0umglgl.h(1201): error C4430: faltando especificador de tipo - int assumido. Observação: C++ não suporta default-int
1>c:program files (x86)windows kits10include10.0.16299.0umglgl.h(1201): error C2086: 'int WINGDIAPI': redefinição
1>c:program files (x86)windows kits10include10.0.16299.0umglgl.h(1157): note: consulte a declaração de 'WINGDIAPI'
1>c:program files (x86)windows kits10include10.0.16299.0umglgl.h(1202): error C2144: erro de sintaxe: 'void' deve ser precedido por ';'
1>c:program files (x86)windows kits10include10.0.16299.0umglgl.h(1202): error C4430: faltando especificador de tipo - int assumido. Observação: C++ não suporta default-int
1>c:program files (x86)windows kits10include10.0.16299.0umglgl.h(1202): error C2086: 'int WINGDIAPI': redefinição
1>c:program files (x86)windows kits10include10.0.16299.0umglgl.h(1157): note: consulte a declaração de 'WINGDIAPI'
1>c:program files (x86)windows kits10include10.0.16299.0umglgl.h(1203): error C2144: erro de sintaxe: 'void' deve ser precedido por ';'
1>c:program files (x86)windows kits10include10.0.16299.0umglgl.h(1203): error C4430: faltando especificador de tipo - int assumido. Observação: C++ não suporta default-int
1>c:program files (x86)windows kits10include10.0.16299.0umglgl.h(1203): error C2086: 'int WINGDIAPI': redefinição
1>c:program files (x86)windows kits10include10.0.16299.0umglgl.h(1157): note: consulte a declaração de 'WINGDIAPI'
1>c:program files (x86)windows kits10include10.0.16299.0umglgl.h(1204): error C2144: erro de sintaxe: 'void' deve ser precedido por ';'
1>c:program files (x86)windows kits10include10.0.16299.0umglgl.h(1204): error C4430: faltando especificador de tipo - int assumido. Observação: C++ não suporta default-int
1>c:program files (x86)windows kits10include10.0.16299.0umglgl.h(1204): error C2086: 'int WINGDIAPI': redefinição
1>c:program files (x86)windows kits10include10.0.16299.0umglgl.h(1157): note: consulte a declaração de 'WINGDIAPI'
1>c:program files (x86)windows kits10include10.0.16299.0umglgl.h(1205): error C2144: erro de sintaxe: 'void' deve ser precedido por ';'
1>c:program files (x86)windows kits10include10.0.16299.0umglgl.h(1205): error C4430: faltando especificador de tipo - int assumido. Observação: C++ não suporta default-int
1>c:program files (x86)windows kits10include10.0.16299.0umglgl.h(1205): error C2086: 'int WINGDIAPI': redefinição
1>c:program files (x86)windows kits10include10.0.16299.0umglgl.h(1157): note: consulte a declaração de 'WINGDIAPI'
1>c:program files (x86)windows kits10include10.0.16299.0umglgl.h(1206): error C2144: erro de sintaxe: 'void' deve ser precedido por ';'
1>c:program files (x86)windows kits10include10.0.16299.0umglgl.h(1206): error C4430: faltando especificador de tipo - int assumido. Observação: C++ não suporta default-int
1>c:program files (x86)windows kits10include10.0.16299.0umglgl.h(1206): error C2086: 'int WINGDIAPI': redefinição
1>c:program files (x86)windows kits10include10.0.16299.0umglgl.h(1157): note: consulte a declaração de 'WINGDIAPI'
1>c:program files (x86)windows kits10include10.0.16299.0umglgl.h(1207): error C2144: erro de sintaxe: 'void' deve ser precedido por ';'
1>c:program files (x86)windows kits10include10.0.16299.0umglgl.h(1207): error C4430: faltando especificador de tipo - int assumido. Observação: C++ não suporta default-int
1>c:program files (x86)windows kits10include10.0.16299.0umglgl.h(1207): error C2086: 'int WINGDIAPI': redefinição
1>c:program files (x86)windows kits10include10.0.16299.0umglgl.h(1157): note: consulte a declaração de 'WINGDIAPI'
1>c:program files (x86)windows kits10include10.0.16299.0umglgl.h(1207): fatal error C1003: contador de erros excede 100; interrompendo compilação
1>Projeto de compilação pronto "Project2.vcxproj" -- FALHA.
========== Compilar: 0 com êxito, 1 com falha, 0 atualizados, 0 ignorados ==========





Heres a part of my gl.h starting on line 1155



Code:

/*************************************************************/

/**ERRORS START HERE**/WINGDIAPI void APIENTRY glAccum (GLenum op, GLfloat value);
WINGDIAPI void APIENTRY glAlphaFunc (GLenum func, GLclampf ref);
WINGDIAPI GLboolean APIENTRY glAreTexturesResident (GLsizei n, const GLuint *textures, GLboolean *residences);
WINGDIAPI void APIENTRY glArrayElement (GLint i);
WINGDIAPI void APIENTRY glBegin (GLenum mode);
WINGDIAPI void APIENTRY glBindTexture (GLenum target, GLuint texture);
WINGDIAPI void APIENTRY glBitmap (GLsizei width, GLsizei height, GLfloat xorig, GLfloat yorig, GLfloat xmove, GLfloat ymove, const GLubyte *bitmap);
WINGDIAPI void APIENTRY glBlendFunc (GLenum sfactor, GLenum dfactor);
WINGDIAPI void APIENTRY glCallList (GLuint list);
WINGDIAPI void APIENTRY glCallLists (GLsizei n, GLenum type, const GLvoid *lists);




Has anyone come across this type of situatuion?

------------------
Read this topic online here:
http://forum.openscenegraph.org/viewtopic.php?p=73471#73471





_______________________________________________
osg-users mailing list
(
Only registered users can see emails on this board!
Get registred or enter the forums!
)
http://lists.openscenegraph.org/listinfo.cgi/osg-users-openscenegraph.org




------------------
Post generated by Mail2Forum
Back to top
Display posts from previous:   
Post new topic   Reply to topic    OpenSceneGraph Forum Forum Index -> Build system [build] All times are GMT
Page 1 of 1

 
Jump to:  
You cannot post new topics in this forum
You cannot reply to topics in this forum
You cannot edit your posts in this forum
You cannot delete your posts in this forum
You cannot vote in polls in this forum
You cannot attach files in this forum
You cannot download files in this forum

Similar Topics
Topic Author Forum Replies Posted
No new posts OpenSceneGraph-3.6.1 release candidate 7 robertosfield General 30 Fri May 25, 2018 11:30 am View latest post
No new posts OpenSceneGraph-3.6.1 release candidat... robertosfield General 4 Tue May 22, 2018 6:41 am View latest post
No new posts OpenSceneGraph-3.6.1 release candidat... robertosfield General 119 Sun May 20, 2018 12:48 pm View latest post
No new posts Please test OpenSceneGraph-3.6 robertosfield General 6 Fri May 18, 2018 2:49 pm View latest post
No new posts OpenSceneGraph-3.6.1-rc4 tagged robertosfield General 0 Sat May 12, 2018 11:52 am View latest post


Board Security Anti Bot Question MOD - phpBB MOD against Spam Bots
Powered by phpBB © 2001, 2005 phpBB Group
Protected by Anti-Spam ACP